sulphuric acid, potassium salt
- Formula: K2O4S
- Molecular weight: 174.259
- IUPAC Standard InChIKey: OTYBMLCTZGSZBG-UHFFFAOYSA-L
- CAS Registry Number: 10233-01-9
- Chemical structure:
View 3d structure (requires JavaScript / HTML 5) - Species with the same structure:
- Other names: Dipotassium sulfate

Gas phase ion energetics data

Data compiled by: Henry M. Rosenstock, Keith Draxl, Bruce W. Steiner, and John T. Herron
Ionization energy determinations
IE (eV) | Method | Reference |
---|---|---|
7.4 ± 0.5 | EI | Ficalora, Uy, et al., 1968 |
Appearance energy determinations
Ion | AE (eV) | Other Products | Method | Reference | Comment |
---|---|---|---|---|---|
K2O+ | 13.0 ± 0.5 | ? | EI | Ficalora, Uy, et al., 1968 |

References

Ficalora, Uy, et al., 1968
Ficalora, P.J.; Uy, O.M.; Muenow, D.W.; Margrave, J.L.,
Mass spectrometric studies at high temperatures: XXIX. Thermal decomposition and sublimation of alkali metal sulfates,
J. Am. Ceram. Soc., 1968, 51, 574. [all data]