Norbornadieone
- Formula: C7H10O
- Molecular weight: 110.1537
- IUPAC Standard InChIKey: ZESXVLLAIXOYKB-UHFFFAOYSA-N
- CAS Registry Number: 10218-02-7
- Chemical structure:
View 3d structure (requires JavaScript / HTML 5) - Species with the same structure:
- Other names: Bicyclo[2.2.1]heptan-7-one; Norbornan-7-one

Gas phase thermochemistry data

Data compiled by: Hussein Y. Afeefy, Joel F. Liebman, and Stephen E. Stein
Quantity | Value | Units | Method | Reference | Comment |
---|---|---|---|---|---|
ΔfH°gas | -134. ± 3. | kJ/mol | Ccb | Steele, 1978 |

Condensed phase thermochemistry data

Data compiled by: Hussein Y. Afeefy, Joel F. Liebman, and Stephen E. Stein
Quantity | Value | Units | Method | Reference | Comment |
---|---|---|---|---|---|
ΔfH°solid | -181.3 ± 2.3 | kJ/mol | Ccb | Steele, 1978 | |
Quantity | Value | Units | Method | Reference | Comment |
ΔcH°solid | -4002.4 ± 2.3 | kJ/mol | Ccb | Steele, 1978 | Corresponding ΔfHºsolid = -181.3 kJ/mol (simple calculation by NIST; no Washburn corrections) |

Phase change data

Data compiled as indicated in comments:
ALS - Hussein Y. Afeefy, Joel F. Liebman, and Stephen E. Stein
AC - William E. Acree, Jr., James S. Chickos
Quantity | Value | Units | Method | Reference | Comment |
---|---|---|---|---|---|
ΔvapH° | 46.65 | kJ/mol | V | Wiberg, Morgan, et al., 1994 | ALS |
Quantity | Value | Units | Method | Reference | Comment |
ΔsubH° | 47. ± 2. | kJ/mol | V | Steele, 1978 | ALS |
ΔsubH° | 47.3 ± 2.2 | kJ/mol | BG | Steele, 1978 | Based on data from 300. to 340. K.; AC |
Enthalpy of vaporization
ΔvapH (kJ/mol) | Temperature (K) | Method | Reference | Comment |
---|---|---|---|---|
47.9 | 335. | EB | Wiberg, Morgan, et al., 1994 | Based on data from 322. to 348. K.; AC |

Reaction thermochemistry data

Data compiled by: Hussein Y. Afeefy, Joel F. Liebman, and Stephen E. Stein
Individual Reactions
C9H16O2 + =
+ 2
By formula: C9H16O2 + H2O = C7H10O + 2CH4O
Quantity | Value | Units | Method | Reference | Comment |
---|---|---|---|---|---|
ΔrH° | 45. ± 2. | kJ/mol | Cm | Wiberg, Morgan, et al., 1994 | liquid phase |
+ 2
= C9H16O2 +
By formula: C7H10O + 2CH4O = C9H16O2 + H2O
Quantity | Value | Units | Method | Reference | Comment |
---|---|---|---|---|---|
ΔrH° | -69. ± 3. | kJ/mol | Cm | Wiberg, Morgan, et al., 1994 | gas phase |

Gas phase ion energetics data

Data evaluated as indicated in comments:
HL - Edward P. Hunter and Sharon G. Lias
Data compiled as indicated in comments:
LLK - Sharon G. Lias, Rhoda D. Levin, and Sherif A. Kafafi
Quantity | Value | Units | Method | Reference | Comment |
---|---|---|---|---|---|
Proton affinity (review) | 832.1 | kJ/mol | N/A | Hunter and Lias, 1998 | HL |
Quantity | Value | Units | Method | Reference | Comment |
Gas basicity | 802.4 | kJ/mol | N/A | Hunter and Lias, 1998 | HL |
Ionization energy determinations
IE (eV) | Method | Reference | Comment |
---|---|---|---|
9.06 | PE | Hentrich, Gunkel, et al., 1974 | Vertical value; LLK |
9.01 ± 0.02 | PE | Chadwick, Frost, et al., 1971 | Vertical value; LLK |

References

Steele, 1978
Steele, W.V.,
The standard enthalpies of formation of bicyclic compounds. IV. Bicyclo[2.2.1]heptan-2-one and bicyclo[2.2.1]heptan-7-one,
J. Chem. Thermodyn., 1978, 10, 585-590. [all data]
Wiberg, Morgan, et al., 1994
Wiberg, K.B.; Morgan, K.M.; Maltz, H.,
Thermochemistry of carbonyl reactions. 6. A study of hydration equilibria,
J. Am. Chem. Soc., 1994, 116, 11067-11077. [all data]
Hunter and Lias, 1998
Hunter, E.P.; Lias, S.G.,
Evaluated Gas Phase Basicities and Proton Affinities of Molecules: An Update,
J. Phys. Chem. Ref. Data, 1998, 27, 3, 413-656, https://doi.org/10.1063/1.556018
. [all data]
Hentrich, Gunkel, et al., 1974
Hentrich, G.; Gunkel, E.; Klessinger, M.,
Photoelektronenspektren organischer verbindungen. 4. Photoelektronenspektren ungesattigter carbonylverbindungen,
J. Mol. Struct., 1974, 21, 231. [all data]
Chadwick, Frost, et al., 1971
Chadwick, D.; Frost, D.C.; Weiler, L.,
Photoelectron spectra of norbornanones and norbornenones,
J. Am. Chem. Soc., 1971, 93, 4962. [all data]