Dicobalt octacarbonyl
- Formula: C8Co2O8
- Molecular weight: 341.9472
- IUPAC Standard InChIKey: NFWSABSVGZVHCA-UHFFFAOYSA-N
- CAS Registry Number: 10210-68-1
- Chemical structure:

Gas phase thermochemistry data

Data compiled by: José A. Martinho Simões
Quantity | Value | Units | Method | Reference | Comment |
---|---|---|---|---|---|
ΔfH°gas | -1183.0 ± 9.1 | kJ/mol | Review | Martinho Simões | |
ΔfH°gas | -1185.2 ± 9.4 | kJ/mol | Review | Martinho Simões | |
ΔfH°gas | -1184.1 ± 6.9 | kJ/mol | Review | Martinho Simões | Selected data. Average of the values from Connor, Skinner, et al., 1973 and Gardner, Cartner, et al., 1975. |

Condensed phase thermochemistry data

Data compiled by: José A. Martinho Simões
Quantity | Value | Units | Method | Reference | Comment |
---|---|---|---|---|---|
ΔfH°solid | -1248.2 ± 8.5 | kJ/mol | Review | Martinho Simões | |
ΔfH°solid | -1250.4 ± 8.8 | kJ/mol | Review | Martinho Simões | |
ΔfH°solid | -1249.3 ± 6.1 | kJ/mol | Review | Martinho Simões | Selected data. Average of the values from Connor, Skinner, et al., 1973 and Gardner, Cartner, et al., 1975. |

Gas phase ion energetics data

Data compiled as indicated in comments:
RDSH - Henry M. Rosenstock, Keith Draxl, Bruce W. Steiner, and John T. Herron
Ionization energy determinations
IE (eV) | Method | Reference | Comment |
---|---|---|---|
8.3 ± 0.1 | EI | Bidinosti and McIntyre, 1970 | RDSH |
8.12 ± 0.22 | EI | Winters and Kiser, 1965 | RDSH |
Appearance energy determinations
Ion | AE (eV) | Other Products | Method | Reference | Comment |
---|---|---|---|---|---|
CoCO+ | 14.4 ± 0.5 | ? | EI | Winters and Kiser, 1965 | RDSH |
Co2CO+ | 16.7 ± 0.3 | 7CO | EI | Winters and Kiser, 1965 | RDSH |
CoC2O2+ | 12.7 ± 0.4 | ? | EI | Winters and Kiser, 1965 | RDSH |
Co2C2O2+ | 14.7 ± 0.5 | 6CO | EI | Winters and Kiser, 1965 | RDSH |
CoC3O3+ | 10.9 ± 0.3 | ? | EI | Winters and Kiser, 1965 | RDSH |
CoC4O4+ | 8.8 ± 0.1 | ? | EI | Bidinosti and McIntyre, 1967 | RDSH |
Co2C4O4+ | 12.2 ± 0.3 | 4CO | EI | Winters and Kiser, 1965 | RDSH |
Co2C5O5+ | 10.1 ± 0.4 | 3CO | EI | Winters and Kiser, 1965 | RDSH |
Co2C6O6+ | 9.4 ± 0.3 | 2CO | EI | Winters and Kiser, 1965 | RDSH |
Co2C7O7+ | 8.6 ± 0.3 | CO | EI | Winters and Kiser, 1965 | RDSH |
Co+ | 16.9 ± 0.4 | ? | EI | Winters and Kiser, 1965 | RDSH |
Co2+ | 17.8 ± 0.4 | 8CO | EI | Winters and Kiser, 1965 | RDSH |

Phase change data

Data compiled as indicated in comments:
AC - William E. Acree, Jr., James S. Chickos
MS - José A. Martinho Simões
Quantity | Value | Units | Method | Reference | Comment |
---|---|---|---|---|---|
ΔsubH° | 15.6 ± 0.79 | kcal/mol | N/A | Pilcher and Skinner, 1983 | See also Cardner, Gartner, et al., 1975.; AC |
ΔsubH° | 15.6 ± 0.79 | kcal/mol | TD-HFC | Gardner, Cartner, et al., 1975 | Another value for the enthalpy of sublimation has been reported: 75.3±6.3 Cartner, Robinson, et al., 1973.; MS |
Enthalpy of sublimation
ΔsubH (kcal/mol) | Temperature (K) | Method | Reference | Comment |
---|---|---|---|---|
20.1 ± 0.1 | 271. | TE | Garner, Chandra, et al., 1995 | Based on data from 264. to 278. K.; AC |
24.81 | 301.5 | A | Stephenson and Malanowski, 1987 | Based on data from 288. to 315. K. See also Baev, 1968.; AC |
18.0 ± 1.5 | 207. to 287. | EM | Cartner, Robinson, et al., 1973, 2 | AC |

References

Martinho Simões
Martinho Simões, J.A.,
Private communication (see http://webbook.nist.gov/chemistry/om/). [all data]
Connor, Skinner, et al., 1973
Connor, J.A.; Skinner, H.A.; Virmani, Y.,
High temperature microcalorimetric studies of the thermal decomposition and iodination of polynuclear carbonyls of Fe, Co, Ru, Rh, Re, Os and Ir,
Faraday Symp. Chem. Soc., 1973, 8, 18, https://doi.org/10.1039/fs9730800018
. [all data]
Gardner, Cartner, et al., 1975
Gardner, P.J.; Cartner, A.; Cunninghame, R.G.; Robinson, B.H.,
J. Chem. Soc., Dalton Trans., 1975, 2582.. [all data]
Bidinosti and McIntyre, 1970
Bidinosti, D.R.; McIntyre, N.S.,
Mass spectrometric study of the thermal decomposition of dimanganese decacarbonyl and dicobalt octacarbonyl,
Can. J. Chem., 1970, 48, 593. [all data]
Winters and Kiser, 1965
Winters, R.E.; Kiser, R.W.,
Ions produced by electron impact with the dimetallic carbonyls of cobalt and manganese,
J. Phys. Chem., 1965, 69, 1618. [all data]
Bidinosti and McIntyre, 1967
Bidinosti, D.R.; McIntyre, N.S.,
The metal-metal bond dissociation energy in cobalt octacarbonyl,
Chem. Commun., 1967, 1. [all data]