Beryllium, bis(2,4-pentanedionato-O,O')-, (T-4)-
- Formula: C10H14BeO4
- Molecular weight: 207.2279
- IUPAC Standard InChIKey: BBKXDHBLPBKCFR-FDGPNNRMSA-L
- CAS Registry Number: 10210-64-7
- Chemical structure:
View 3d structure (requires JavaScript / HTML 5) - Other names: Beryllium acetylacetonate; Beryllium, bis(2,4-pentanedionato)-; Beryllium bis(acetylacetonate); Beryllium diacetylacetonate; Bis(acetylacetonato)beryllium; Bis(2,4-pentanedionato)beryllium; Beryllium 2,4-pentadionate; Beryllium, bis(2,4-pentanedionato-O,O')-; bis(pentane-2,4-dionato-O,O')beryllium

Phase change data

Data compiled as indicated in comments:
TRC - Thermodynamics Research Center, NIST Boulder Laboratories, Chris Muzny director
AC - William E. Acree, Jr., James S. Chickos
Quantity | Value | Units | Method | Reference | Comment |
---|---|---|---|---|---|
Tfus | 381. | K | N/A | Murray and Hill, 1983 | Uncertainty assigned by TRC = 1. K; TRC |
Quantity | Value | Units | Method | Reference | Comment |
ΔsubH° | 91. ± 1.4 | kJ/mol | C | Murata, Sakiyama, et al., 1985 | AC |
ΔsubH° | 94. ± 1.0 | kJ/mol | ME | Naghibi-Bidokhti, 1977 | See also da Silva and Ferrao, 1988.; AC |
Enthalpy of vaporization
ΔvapH (kJ/mol) | Temperature (K) | Method | Reference | Comment |
---|---|---|---|---|
65.7 ± 1.1 | 447. | BG | Lazarev, Greenberg, et al., 1988 | Based on data from 382. to 511. K.; AC |
Enthalpy of fusion
ΔfusH (kJ/mol) | Temperature (K) | Method | Reference | Comment |
---|---|---|---|---|
15.7 | 381.2 | DSC | Murray and Hill, 1983, 2 | AC |

Gas phase ion energetics data

Data compiled as indicated in comments:
LLK - Sharon G. Lias, Rhoda D. Levin, and Sherif A. Kafafi
Ionization energy determinations
IE (eV) | Method | Reference | Comment |
---|---|---|---|
8.1 | PE | Evans, Hamnett, et al., 1972 | LLK |
8.41 ± 0.07 | PE | Evans, Hamnett, et al., 1972 | Vertical value; LLK |

References

Murray and Hill, 1983
Murray, J.P.; Hill, J.O.,
DSC determination of the fusion and sublimation enthalpy of bis(2,4-pentanedionato)beryllium(II) and tris(2,4-pentanedionato)aluminium(III),
Thermochim. Acta, 1983, 63, 211. [all data]
Murata, Sakiyama, et al., 1985
Murata, S.; Sakiyama, M.; Seki, S.,
Sublimation calorimetric studies using a calvet microcalorimeter,
Thermochimica Acta, 1985, 88, 1, 121-126, https://doi.org/10.1016/0040-6031(85)85419-8
. [all data]
Naghibi-Bidokhti, 1977
Naghibi-Bidokhti, H.,
, Ph.D. Thesis, University of Surrey, 1977. [all data]
da Silva and Ferrao, 1988
da Silva, M.A.V. Ribeiro; Ferrao, Maria Luisa C.C.H.,
Energetics of metal-oxygen bonds in metal complexes of β-diketones,
Polym. J., 1988, 60, 8, https://doi.org/10.1351/pac198860081225
. [all data]
Lazarev, Greenberg, et al., 1988
Lazarev, V.B.; Greenberg, J.H.; Ozerova, Z.P.; Sharpataya, G.A.,
DSC and vapour pressure investigation of some β-diketonates,
Journal of Thermal Analysis, 1988, 33, 3, 797-799, https://doi.org/10.1007/BF02138589
. [all data]
Murray and Hill, 1983, 2
Murray, J.P.; Hill, J.O.,
DSC determination of the fusion and sublimation enthalpy of bis(2,4-pentanedionato)beryllium(II) and tris(2,4-pentanedionato)aluminium(III),
Thermochimica Acta, 1983, 63, 2, 211-218, https://doi.org/10.1016/0040-6031(83)80086-0
. [all data]
Evans, Hamnett, et al., 1972
Evans, S.; Hamnett, A.; Orchard, A.F.; Lloyd, D.R.,
Study of the metal-oxygen bond in simple tris-chelate complexes by He(I) photoelectron spectroscopy,
Faraday Discuss. Chem. Soc., 1972, 54, 227. [all data]