1,2,4,5-Tetrazine, 3,6-dihydro-3,6-bis(trimethylsilyl)
- Formula: C8H20N4Si2
- Molecular weight: 228.4422
- IUPAC Standard InChIKey: OSIMAMNETSCXKT-UHFFFAOYSA-N
- CAS Registry Number: 102101-03-1
- Chemical structure:
View 3d structure (requires JavaScript / HTML 5) - Permanent link for this species. Use this link for bookmarking this species for future reference.

Gas phase ion energetics data

Data compiled by: Sharon G. Lias, John E. Bartmess, Joel F. Liebman, John L. Holmes, Rhoda D. Levin, and W. Gary Mallard
Ionization energy determinations
IE (eV) | Method | Reference | Comment |
---|---|---|---|
6.6 | PE | Kaim, 1985 | |
7.15 | PE | Kaim, 1985 | Vertical value |

References

Kaim, 1985
Kaim, W.,
Electronic structure of 1,4-dihydro-1,2,4,5-tetrazines and of related 1,4-dihydroaromatic compounds,
J. Chem. Soc. Perkin Trans. 2, 1985, 1633. [all data]