Diphenyl carbonate
- Formula: C13H10O3
- Molecular weight: 214.2167
- IUPAC Standard InChIKey: ROORDVPLFPIABK-UHFFFAOYSA-N
- CAS Registry Number: 102-09-0
- Chemical structure:
View 3d structure (requires JavaScript / HTML 5) - Other names: Carbonic acid, diphenyl ester; Phenyl carbonate; Phenol carbonate

Gas phase thermochemistry data

Data compiled by: Hussein Y. Afeefy, Joel F. Liebman, and Stephen E. Stein
Quantity | Value | Units | Method | Reference | Comment |
---|---|---|---|---|---|
ΔfH°gas | -311. ± 8.8 | kJ/mol | Ccb | Carson, Fine, et al., 1971 | Hfusion=5.6±0.3 |

Condensed phase thermochemistry data

Data compiled as indicated in comments:
ALS - Hussein Y. Afeefy, Joel F. Liebman, and Stephen E. Stein
DH - Eugene S. Domalski and Elizabeth D. Hearing
Quantity | Value | Units | Method | Reference | Comment |
---|---|---|---|---|---|
ΔfH°solid | -401.4 ± 1.9 | kJ/mol | Ccb | Sinke, Hildenbrand, et al., 1958 | ALS |
Quantity | Value | Units | Method | Reference | Comment |
ΔcH°solid | -6143.6 ± 1.9 | kJ/mol | Ccb | Sinke, Hildenbrand, et al., 1958 | Corresponding ΔfHºsolid = -401.2 kJ/mol (simple calculation by NIST; no Washburn corrections); ALS |
Quantity | Value | Units | Method | Reference | Comment |
S°solid,1 bar | 278.40 | J/mol*K | N/A | Sinke, Hildenbrand, et al., 1958 | DH |
Constant pressure heat capacity of solid
Cp,solid (J/mol*K) | Temperature (K) | Reference | Comment |
---|---|---|---|
263.13 | 298.15 | Sinke, Hildenbrand, et al., 1958 | T = 15 to 310 K.; DH |

Phase change data

Data compiled as indicated in comments:
BS - Robert L. Brown and Stephen E. Stein
AC - William E. Acree, Jr., James S. Chickos
ALS - Hussein Y. Afeefy, Joel F. Liebman, and Stephen E. Stein
Quantity | Value | Units | Method | Reference | Comment |
---|---|---|---|---|---|
Tboil | 574.7 | K | N/A | Aldrich Chemical Company Inc., 1990 | BS |
Tboil | 579.2 | K | N/A | Weast and Grasselli, 1989 | BS |
Quantity | Value | Units | Method | Reference | Comment |
ΔvapH° | 80.9 ± 0.6 | kJ/mol | GS | Verevkin, Emel'yanenko, et al., 2008 | Based on data from 355. to 381. K.; AC |
Quantity | Value | Units | Method | Reference | Comment |
ΔsubH° | 90. ± 8.4 | kJ/mol | E | Carson, Fine, et al., 1971, 2 | See also Pedley and Rylance, 1977.; AC |
ΔsubH° | 90.0 ± 8.4 | kJ/mol | V | Carson, Fine, et al., 1971 | Hfusion=5.6±0.3; ALS |
Enthalpy of fusion
ΔfusH (kJ/mol) | Temperature (K) | Reference | Comment |
---|---|---|---|
23.43 | 355. | Carson, Fine, et al., 1971, 2 | AC |

Gas phase ion energetics data

Data compiled by: Henry M. Rosenstock, Keith Draxl, Bruce W. Steiner, and John T. Herron
Ionization energy determinations
IE (eV) | Method | Reference |
---|---|---|
9.01 ± 0.05 | EI | Natalis and Franklin, 1965 |
Appearance energy determinations
Ion | AE (eV) | Other Products | Method | Reference | Comment |
---|---|---|---|---|---|
C6H5+ | 12.1 ± 0.1 | ? | EI | Natalis and Franklin, 1965 | |
C11H9+ | 13.90 ± 0.05 | ? | EI | Natalis and Franklin, 1965 | |
C11H10+ | 12.4 ± 0.1 | ? | EI | Natalis and Franklin, 1965 | |
C12H9O+ | 12.51 ± 0.05 | ? | EI | Natalis and Franklin, 1965 | |
C12H10O+ | 10.78 ± 0.05 | CO2 | EI | Natalis and Franklin, 1965 |

References

Carson, Fine, et al., 1971
Carson, A.S.; Fine, D.H.; Gray, P.; Laye, P.G.,
Standard enthalpies of formation of diphenyl oxalate and benzoic anhydride and some related bond dissociation energies,
J. Chem. Soc. B, 1971, 1611-1615. [all data]
Sinke, Hildenbrand, et al., 1958
Sinke, G.C.; Hildenbrand, D.L.; McDonald, R.A.; Kramer, W.R.; Stull, D.R.,
The heat, entropy and free energy of formation of diphenyl carbonate,
J. Phys. Chem., 1958, 62, 1461-1462. [all data]
Aldrich Chemical Company Inc., 1990
Aldrich Chemical Company Inc.,
Catalog Handbook of Fine Chemicals, Aldrich Chemical Company, Inc., Milwaukee WI, 1990, 1. [all data]
Weast and Grasselli, 1989
CRC Handbook of Data on Organic Compounds, 2nd Editon, Weast,R.C and Grasselli, J.G., ed(s)., CRC Press, Inc., Boca Raton, FL, 1989, 1. [all data]
Verevkin, Emel'yanenko, et al., 2008
Verevkin, Sergey P.; Emel'yanenko, Vladimir N.; Kozlova, Svetlana A.,
Organic Carbonates: Experiment and ab Initio Calculations for Prediction of Thermochemical Properties,
J. Phys. Chem. A, 2008, 112, 42, 10667-10673, https://doi.org/10.1021/jp8024705
. [all data]
Carson, Fine, et al., 1971, 2
Carson, A.S.; Fine, D.H.; Gray, P.; Laye, P.G.,
Standard enthalpies of formation of diphenyl oxalate and benzoic anhydride and some related bond dissociation energies,
J. Chem. Soc., B:, 1971, 1611, https://doi.org/10.1039/j29710001611
. [all data]
Pedley and Rylance, 1977
Pedley, J.B.; Rylance, J.,
, Computer Analysed Thermochemical Data: Organic and Organometallic Compounds, University of Sussex, Brighton, 1977. [all data]
Natalis and Franklin, 1965
Natalis, P.; Franklin, J.L.,
Ionization and dissociation of diphenyl and condensed ring aromatics by electron impact. II. Diphenylcarbonyls and ethers,
J. Phys. Chem., 1965, 69, 2943. [all data]