Dibemethine
- Formula: C15H17N
- Molecular weight: 211.3022
- IUPAC Standard InChIKey: WYZDCUGWXKHESN-UHFFFAOYSA-N
- CAS Registry Number: 102-05-6
- Chemical structure:
View 3d structure (requires JavaScript / HTML 5) - Other names: Benzenemethanamine, N-methyl-N-(phenylmethyl)-; Dibenzylamine, N-methyl-; Dibemethin; Dibenzylmethylamine; DBMA; L 566; Methyldibenzylamine; N-Methyl-N,N-Dibenzylamine; N-Methyldibenzylamine; N,N-Dibenzylmethylamine; Revoxyl; NSC 163900

Gas phase ion energetics data

Data compiled by: Henry M. Rosenstock, Keith Draxl, Bruce W. Steiner, and John T. Herron
Ionization energy determinations
IE (eV) | Method | Reference |
---|---|---|
7.85 | PE | Bodor, Dewar, et al., 1970 |

Van Den Dool and Kratz RI, non-polar column, temperature ramp

Column type | Active phase | I | Reference | Comment |
---|---|---|---|---|
Capillary | OV-1 | 1657.1 | Gautzsch and Zinn, 1996 | 8. K/min; Tstart: 35. C; Tend: 300. C |

Normal alkane RI, polar column, custom temperature program

Column type | Active phase | I | Reference | Comment |
---|---|---|---|---|
Capillary | DB-Wax | 2251. | Peng, Yang, et al., 1991 | Program: not specified |

References

Bodor, Dewar, et al., 1970
Bodor, N.; Dewar, M.J.S.; Jennings, W.B.; Worley, S.D.,
Photoelectron spectra of molecules-IV.Ionization potentials and heats of formation of some hydrazines and amines,
Tetrahedron, 1970, 26, 4109. [all data]
Gautzsch and Zinn, 1996
Gautzsch, R.; Zinn, P.,
Use of incremental models to estimate the retention indexes of aromatic compounds,
Chromatographia, 1996, 43, 3/4, 163-176, https://doi.org/10.1007/BF02292946
. [all data]
Peng, Yang, et al., 1991
Peng, C.T.; Yang, Z.C.; Ding, S.F.,
Prediction of rentention idexes. II. Structure-retention index relationship on polar columns,
J. Chromatogr., 1991, 586, 1, 85-112, https://doi.org/10.1016/0021-9673(91)80028-F
. [all data]