1H-Indole-3-ethanamine, 5-methoxy-N,N-dimethyl-
- Formula: C13H18N2O
- Molecular weight: 218.2948
- IUPAC Standard InChIKey: ZSTKHSQDNIGFLM-UHFFFAOYSA-N
- CAS Registry Number: 1019-45-0
- Chemical structure:
View 3d structure (requires JavaScript / HTML 5) - Other names: Bufotenine, O-methyl-; CT 4334; 3-(2-Dimethylaminoethyl)-5-methoxyindole; N,N-Dimethyl-5-methoxytryptamine; Indole, 3-[2-(dimethylamino)ethyl]-5-methoxy-; Methoxybufotenin; 5-Methoxydimethyltryptamine; 5-Methoxy-N,N-dimethyltryptamine; Methylbufotenine; O-Methylbufotenine; Indole, 3-(2-(N,N-dimethylamino)ethyl)-5-methoxy-; MeODMT; 3-(2-(N,N-Dimethylamino)ethyl)-5-methoxyindole; NSC 88624; 5-methoxy-N-Dimethyltryptamine; 5-methoxy-N,N-dimethyl-1H-indole-3-ethylamine

Gas phase ion energetics data

Data compiled as indicated in comments:
LLK - Sharon G. Lias, Rhoda D. Levin, and Sherif A. Kafafi
Ionization energy determinations
IE (eV) | Method | Reference | Comment |
---|---|---|---|
7.61 ± 0.14 | PE | Domelsmith, Munchausen, et al., 1977 | Vertical value; LLK |

Normal alkane RI, non-polar column, temperature ramp

Column type | Active phase | I | Reference | Comment |
---|---|---|---|---|
Packed | SE-30 | 1960. | Narasimhachari, Spaide, et al., 1971 | Column length: 2. m; Tstart: 140. C |

References

Domelsmith, Munchausen, et al., 1977
Domelsmith, L.N.; Munchausen, L.L.; Houk, K.N.,
Photoelectron spectra of psychotropic drugs. 1. Phenethylamines, tryptamines, and LSD,
J. Am. Chem. Soc., 1977, 99, 4311. [all data]
Narasimhachari, Spaide, et al., 1971
Narasimhachari, N.; Spaide, J.; Heller, B.,
Gas liquid chromatographic and mass spectrometric studies on trimethylsilyl derivatives of N-methyl- and N,N-dimethyltryptamines,
J. Chromatogr. Sci., 1971, 9, 8, 502-505, https://doi.org/10.1093/chromsci/9.8.502
. [all data]