Cyclohexyl mercuric bromide
- Formula: C6H11BrHg
- Molecular weight: 363.65
- IUPAC Standard InChIKey: RYUAWGQSCJCZQT-UHFFFAOYSA-M
- CAS Registry Number: 10192-55-9
- Chemical structure:
View 3d structure (requires JavaScript / HTML 5) - Permanent link for this species. Use this link for bookmarking this species for future reference.

Gas phase ion energetics data

Data compiled by: Sharon G. Lias, John E. Bartmess, Joel F. Liebman, John L. Holmes, Rhoda D. Levin, and W. Gary Mallard
Ionization energy determinations
IE (eV) | Method | Reference | Comment |
---|---|---|---|
9.40 ± 0.05 | PE | Baidin, Timoshenko, et al., 1985 | Vertical value |

References

Baidin, Timoshenko, et al., 1985
Baidin, V.N.; Timoshenko, M.M.; Chizhov, Y.V.; Ustynyuk, Y.A.; Kritskaya, I.I.,
Photoelectron spectra nad the structure of organomercury compounds,
J. Organomet. Chem., 1985, 292, 55. [all data]