Benzenamine, 4,4'-oxybis-
- Formula: C12H12N2O
- Molecular weight: 200.2365
- IUPAC Standard InChIKey: HLBLWEWZXPIGSM-UHFFFAOYSA-N
- CAS Registry Number: 101-80-4
- Chemical structure:
View 3d structure (requires JavaScript / HTML 5) - Other names: Aniline, 4,4'-oxydi-; p-Aminophenyl ether; p,p'-Diaminodiphenyl ether; p,p'-Oxydianiline; Bis(p-aminophenyl) ether; Bis(4-aminophenyl) ether; Diaminodiphenyl ether; Oxybis[4-aminobenzene]; Oxydi-p-phenylenediamine; 4-Aminophenyl ether; 4,4'-Diaminodiphenyl ether; 4,4'-Diaminodiphenyl oxide; 4,4'-Diaminophenyl ether; 4,4'-Oxybis[aniline]; 4,4'-Oxydianiline; di(4-Aminophenyl) ether; p,p'-Oxybis(aniline); Dadpe; Ether, 4,4'-diaminodiphenyl-; NCI-C50146; Oxydianiline; 4,4-Dadpe; 4,4-Diaminodiphenyl ether; 4,4-Oxydianiline; 4,4'-Diaminobiphenyl oxide; 4,4'-Oxybisbenzenamine; 4,4'-Oxydiphenylamine; 4,4'-Diaminophenyl oxide; NSC 37075; 4-(4-Aminophenoxy)phenylamine

Condensed phase thermochemistry data

Data compiled as indicated in comments:
ALS - Hussein Y. Afeefy, Joel F. Liebman, and Stephen E. Stein
DH - Eugene S. Domalski and Elizabeth D. Hearing
Quantity | Value | Units | Method | Reference | Comment |
---|---|---|---|---|---|
ΔfH°solid | -17. | kJ/mol | Ccb | Karyakin, Bazhan, et al., 1977 | ALS |
Quantity | Value | Units | Method | Reference | Comment |
ΔcH°solid | -6420. ± 1. | kJ/mol | Ccb | Karyakin, Bazhan, et al., 1977 | ALS |
Quantity | Value | Units | Method | Reference | Comment |
S°solid,1 bar | 241.0 | J/mol*K | N/A | Karyakin, Bazhan, et al., 1977, 2 | DH |
Constant pressure heat capacity of solid
Cp,solid (J/mol*K) | Temperature (K) | Reference | Comment |
---|---|---|---|
278.2 | 298. | Lesbats and Lichanot, 1987 | T = 250 to 400 K.; DH |
280.7 | 298. | Marchidan and Ciopec, 1978 | T = 298 to 502 K.; DH |
258.4 | 300. | Karyakin, Bazhan, et al., 1977, 2 | T = 60 to 400 K.; DH |

Phase change data

Data compiled as indicated in comments:
DH - Eugene S. Domalski and Elizabeth D. Hearing
TRC - Thermodynamics Research Center, NIST Boulder Laboratories, Chris Muzny director
AC - William E. Acree, Jr., James S. Chickos
Quantity | Value | Units | Method | Reference | Comment |
---|---|---|---|---|---|
Tfus | 464. | K | N/A | Lesbats and Lichanot, 1987 | DH |
Tfus | 465.4 | K | N/A | Marchidan and Ciopec, 1978, 2 | Uncertainty assigned by TRC = 0.1 K; TRC |
Enthalpy of fusion
ΔfusH (kJ/mol) | Temperature (K) | Reference | Comment |
---|---|---|---|
7.74 | 465.4 | Domalski and Hearing, 1996 | AC |
7.740 | 465.4 | Marchidan and Ciopec, 1978 | DH |
Entropy of fusion
ΔfusS (J/mol*K) | Temperature (K) | Reference | Comment |
---|---|---|---|
16.6 | 465.4 | Marchidan and Ciopec, 1978 | DH |

Reaction thermochemistry data

Data compiled by: Hussein Y. Afeefy, Joel F. Liebman, and Stephen E. Stein
Individual Reactions
+
= C20H16N2O4
By formula: C12H12N2O + C8H4O3 = C20H16N2O4
Quantity | Value | Units | Method | Reference | Comment |
---|---|---|---|---|---|
ΔrH° | -69.9 ± 0.4 | kJ/mol | Eqk | Karyakin, Rabinovich, et al., 1978 | liquid phase; solvent: DMF |

Gas phase ion energetics data

Data compiled by: Sharon G. Lias, Rhoda D. Levin, and Sherif A. Kafafi
Ionization energy determinations
IE (eV) | Method | Reference |
---|---|---|
6.55 | PI | Pykhtina, Cherednichenko, et al., 1974 |

References

Karyakin, Bazhan, et al., 1977
Karyakin, N.V.; Bazhan, N.G.; Sapozhnikov, V.N.; Shvetsova, K.G.; Berestneva, G.L.; Lomteva, A.N.; Zimin, Yu.B.; Korshak, V.V.,
Thermodynamics of synthesis of poly-(p,p'-diphenyleneoxide)pyromellitimide,
Polym. Sci. USSR, 1977, 19, 1766-1775. [all data]
Karyakin, Bazhan, et al., 1977, 2
Karyakin, N.V.; Bazhan, N.G.; Sapozhnikov, V.N.; Shvetsova, K.G.; Berestneva, G.L.; Lomteva, A.N.; Zimin, Yu.B.; Korshak, V.V.,
Thermodynamics of synthesis of poly-(p,p'-diphenylene oxide)pyromellitimide,
Vysokomol. Soedin., 1977, A19, 1541-1548. [all data]
Lesbats and Lichanot, 1987
Lesbats, C.; Lichanot, A.,
Capacites calorifiques de durcisseurs amines et resines epoxydes,
Thermochim. Acta, 1987, 109, 317-329. [all data]
Marchidan and Ciopec, 1978
Marchidan, D.I.; Ciopec, M.,
Relative enthalpies and related thermodynamic functions of some organic compounds by drop calorimetry,
J. Therm. Anal., 1978, 14, 131-150. [all data]
Marchidan and Ciopec, 1978, 2
Marchidan, D.I.; Ciopec, M.,
Relative enthalpies and related thermodynamic functions of some organic compounds by drop calorimetry,
J. Therm. Anal., 1978, 14, 131-49. [all data]
Domalski and Hearing, 1996
Domalski, Eugene S.; Hearing, Elizabeth D.,
Heat Capacities and Entropies of Organic Compounds in the Condensed Phase. Volume III,
J. Phys. Chem. Ref. Data, 1996, 25, 1, 1, https://doi.org/10.1063/1.555985
. [all data]
Karyakin, Rabinovich, et al., 1978
Karyakin, N.V.; Rabinovich, I.B.; Pal'tseva, N.G.,
Thermodynamics of the reactions of aromatic diamines with dianhydrides of tetracarboxylic acids,
Polym. Sci. USSR, 1978, 20, 2274-2279. [all data]
Pykhtina, Cherednichenko, et al., 1974
Pykhtina, E.V.; Cherednichenko, L.V.; Kardash, I.E.; Evlasheva, T.I.; Sorokin, V.V.; Potapov, V.K.; Pravednikov, A.N.,
Ionization potentials of amines and energies of charge transfer bands in the absorption spectra of complexes of 7,7,8,8-tetracyanoquinodimethan,
High Energy Chem., 1974, 8, 257, In original 307. [all data]