Dimanganese decacarbonyl
- Formula: C10Mn2O10
- Molecular weight: 389.9771
- IUPAC Standard InChIKey: QFEOTYVTTQCYAZ-UHFFFAOYSA-N
- CAS Registry Number: 10170-69-1
- Chemical structure:

Gas phase thermochemistry data

Data compiled by: José A. Martinho Simões
Quantity | Value | Units | Method | Reference | Comment |
---|---|---|---|---|---|
ΔfH°gas | -1585.3 ± 4.3 | kJ/mol | Review | Martinho Simões | Selected data. |
ΔfH°gas | -1582.2 ± 9.4 | kJ/mol | Review | Martinho Simões | |
ΔfH°gas | -1582.8 ± 9.2 | kJ/mol | Review | Martinho Simões |

Condensed phase thermochemistry data

Data compiled by: José A. Martinho Simões
Quantity | Value | Units | Method | Reference | Comment |
---|---|---|---|---|---|
ΔfH°solid | -1677.6 ± 3.7 | kJ/mol | Review | Martinho Simões | Selected data. |
ΔfH°solid | -1674.5 ± 9.2 | kJ/mol | Review | Martinho Simões | |
ΔfH°solid | -1675.1 ± 9.0 | kJ/mol | Review | Martinho Simões | |
Quantity | Value | Units | Method | Reference | Comment |
ΔcH°solid | -3251.0 ± 3.3 | kJ/mol | CC-RB | Good, Fairbrother, et al., 1958 | Please also see Pedley and Rylance, 1977 and Cox and Pilcher, 1970. |

Gas phase ion energetics data

Data compiled as indicated in comments:
LLK - Sharon G. Lias, Rhoda D. Levin, and Sherif A. Kafafi
RDSH - Henry M. Rosenstock, Keith Draxl, Bruce W. Steiner, and John T. Herron
Ionization energy determinations
IE (eV) | Method | Reference | Comment |
---|---|---|---|
8.32 ± 0.01 | EI | Michels and Svec, 1981 | LLK |
7.7 | PE | Higginson, Lloyd, et al., 1975 | LLK |
7.69 ± 0.01 | PE | Connor, Zafarani-Moattar, et al., 1972 | LLK |
8.46 ± 0.03 | EI | Junk and Svec, 1970 | RDSH |
8.4 ± 0.1 | EI | Bidinosti and McIntyre, 1970 | RDSH |
8.55 ± 0.10 | EI | Winters and Kiser, 1965 | RDSH |
8.02 | PE | Higginson, Lloyd, et al., 1975 | Vertical value; LLK |
8.02 | PE | Evans, Green, et al., 1969 | Vertical value; RDSH |
Appearance energy determinations
Ion | AE (eV) | Other Products | Method | Reference | Comment |
---|---|---|---|---|---|
MnCO+ | 18.21 | ? | EI | Svec and Junk, 1967 | RDSH |
MnCO+ | 17.5 ± 0.2 | ? | EI | Winters and Kiser, 1965 | RDSH |
MnC2O2+ | 14.80 | ? | EI | Svec and Junk, 1967 | RDSH |
Mn2C2O2+ | 16.43 | 8CO | EI | Svec and Junk, 1967 | RDSH |
Mn2C3O3+ | 15.34 | 7CO | EI | Svec and Junk, 1967 | RDSH |
Mn2C4O4+ | 13.98 | 6CO | EI | Svec and Junk, 1967 | RDSH |
Mn2C4O4+ | 14.0 ± 0.2 | 6CO | EI | Winters and Kiser, 1965 | RDSH |
MnC5O5+ | 9.40 | ? | EI | Svec and Junk, 1967 | RDSH |
MnC5O5+ | 9.3 ± 0.1 | ? | EI | Bidinosti and McIntyre, 1966 | RDSH |
Mn2C5O5+ | 11.91 | 5CO | EI | Svec and Junk, 1967 | RDSH |
Mn2C5O5+ | 12.6 ± 0.2 | 5CO | EI | Winters and Kiser, 1965 | RDSH |
Mn+ | 22.13 | ? | EI | Svec and Junk, 1967 | RDSH |
Mn+ | 20.8 ± 0.4 | ? | EI | Winters and Kiser, 1965 | RDSH |
Mn2+ | 18.73 | 10CO | EI | Svec and Junk, 1967 | RDSH |
Mn2+ | 18.8 ± 0.3 | 10CO | EI | Winters and Kiser, 1965 | RDSH |

References

Martinho Simões
Martinho Simões, J.A.,
Private communication (see http://webbook.nist.gov/chemistry/om/). [all data]
Good, Fairbrother, et al., 1958
Good, W.D.; Fairbrother, D.M.; Waddington, G.,
J. Phys. Chem., 1958, 62, 853. [all data]
Pedley and Rylance, 1977
Pedley, J.B.; Rylance, J.,
Computer Analysed Thermochemical Data: Organic and Organometallic Compounds, University of Sussex, Brigton, 1977. [all data]
Cox and Pilcher, 1970
Cox, J.D.; Pilcher, G.,
Thermochemistry of Organic and Organometallic Compounds
in Academic Press, New York, 1970. [all data]
Michels and Svec, 1981
Michels, G.D.; Svec, H.J.,
Characterization of MnTc(CO)10 and TcRe(CO)10,
Inorg. Chem., 1981, 20, 3445. [all data]
Higginson, Lloyd, et al., 1975
Higginson, B.R.; Lloyd, D.R.; Evans, S.; Orchard, A.F.,
Photoelectron studies of metal carbonyls. Part 5. - Substituted group VIIA carbonyls,
J. Chem. Soc. Faraday Trans. 2, 1975, 71, 1913. [all data]
Connor, Zafarani-Moattar, et al., 1972
Connor, J.A.; Zafarani-Moattar, M.T.; Bickerton, J.; ElSaied, N.I.; Suradi, S.; Carson, R.; AlTakhin, G.; Skinner, H.A.,
[Title unavailable],
Organometallics, 1972, 1, 1166. [all data]
Junk and Svec, 1970
Junk, G.A.; Svec, H.J.,
The mass spectra, ionization potentials, and bond energies of the group VIIA decacarbonyls,
J. Chem. Soc. A, 1970, 2102. [all data]
Bidinosti and McIntyre, 1970
Bidinosti, D.R.; McIntyre, N.S.,
Mass spectrometric study of the thermal decomposition of dimanganese decacarbonyl and dicobalt octacarbonyl,
Can. J. Chem., 1970, 48, 593. [all data]
Winters and Kiser, 1965
Winters, R.E.; Kiser, R.W.,
Ions produced by electron impact with the dimetallic carbonyls of cobalt and manganese,
J. Phys. Chem., 1965, 69, 1618. [all data]
Evans, Green, et al., 1969
Evans, S.; Green, J.C.; Green, M.L.H.; Orchard, A.F.; Turner, D.W.,
Study of the bonding in pentacarbonylmanganese derivatives by photoelectron spectroscopy,
Faraday Discuss. Chem. Soc., 1969, 47, 112. [all data]
Svec and Junk, 1967
Svec, H.J.; Junk, G.A.,
Energetics of the ionization and dissociation of Mn2(CO)10, Re2(CO)10, and ReMn(CO)10,
J. Am. Chem. Soc., 1967, 89, 2836. [all data]
Bidinosti and McIntyre, 1966
Bidinosti, D.R.; McIntyre, N.S.,
The metal-metal bond dissociation energy in manganese carbonyl,
Chem. Commun., 1966, 555. [all data]