Dibenzothiophene sulfone
- Formula: C12H8O2S
- Molecular weight: 216.256
- IUPAC Standard InChIKey: IKJFYINYNJYDTA-UHFFFAOYSA-N
- CAS Registry Number: 1016-05-3
- Chemical structure:
View 3d structure (requires JavaScript / HTML 5) - Other names: Dibenzothiophene, 5,5-dioxide; Dibenzothiophene dioxide; Dibenzothiophene S,S-dioxide; Diphenylene sulfone

Phase change data

Data compiled by: William E. Acree, Jr., James S. Chickos
Enthalpy of fusion
ΔfusH (kJ/mol) | Temperature (K) | Method | Reference |
---|---|---|---|
27.17 | 509.2 | DSC | Ramírez-Verduzco, Rojas-Aguilar, et al., 2007 |

Gas phase ion energetics data

Data compiled as indicated in comments:
LLK - Sharon G. Lias, Rhoda D. Levin, and Sherif A. Kafafi
Ionization energy determinations
IE (eV) | Method | Reference | Comment |
---|---|---|---|
8.9 | PE | Solouki, Bock, et al., 1975 | LLK |
9.28 | EI | Terlouw, Heerma, et al., 1974 | LLK |
8.90 | PE | Solouki, Bock, et al., 1975 | Vertical value; LLK |

References

Ramírez-Verduzco, Rojas-Aguilar, et al., 2007
Ramírez-Verduzco, Luis F.; Rojas-Aguilar, Aarón; De los Reyes, José A.; Muñoz-Arroyo, José A.; Murrieta-Guevara, Florentino,
Solid-Liquid Equilibria of Dibenzothiophene and Dibenzothiophene Sulfone in Organic Solvents,
J. Chem. Eng. Data, 2007, 52, 6, 2212-2219, https://doi.org/10.1021/je700234e
. [all data]
Solouki, Bock, et al., 1975
Solouki, B.; Bock, H.; Appel, R.,
Photoelektronenspektren und Molekuleigenschaften, XLV Schwefelsaure-Derivate X2SY2: Alkyl-, Vinyl- und Arylsulfone, Alkylsulfoimide und Sulfurylhalogenide,
Chem. Ber., 1975, 108, 897. [all data]
Terlouw, Heerma, et al., 1974
Terlouw, J.K.; Heerma, W.; Frintrop, P.C.M.; Dijkstra, G.; Meinema, H.A.,
Electron-impact induced fragmentation of some heterocyclic-tin compounds,
J. Organomet. Chem., 1974, 64, 205. [all data]
Lang (editor), 1963
Lang (editor), L.,
Absorption Spectra in the Ultraviolet and Visible Region, 1963, 4, 363. [all data]