Sulfide, allyl methyl
- Formula: C4H8S
- Molecular weight: 88.171
- IUPAC Standard InChIKey: NVLPQIPTCCLBEU-UHFFFAOYSA-N
- CAS Registry Number: 10152-76-8
- Chemical structure:
View 3d structure (requires JavaScript / HTML 5) - Other names: 1-Propene, 3-(methylthio)-; Allyl methyl sulfide; Methyl allyl sulfide; 3-(Methylthio)propene; CH3SCH2CH=CH2; 3-(Methylsulfanyl)-1-propene; 3-(Methylthio)-1-propene; Methyl 2-propenyl sulfide; Methyl allyl sulphide; allyl methyl sulphide

Phase change data

Data compiled by: Robert L. Brown and Stephen E. Stein
Quantity | Value | Units | Method | Reference | Comment |
---|---|---|---|---|---|
Tboil | 365.2 | K | N/A | Weast and Grasselli, 1989 | |
Tboil | 365. | K | N/A | American Tokyo Kasei, 1988 |

Reaction thermochemistry data

Data compiled as indicated in comments:
B - John E. Bartmess
ALS - Hussein Y. Afeefy, Joel F. Liebman, and Stephen E. Stein
Individual Reactions
C4H7S- + =
By formula: C4H7S- + H+ = C4H8S
Quantity | Value | Units | Method | Reference | Comment |
---|---|---|---|---|---|
ΔrH° | 1563. ± 17. | kJ/mol | G+TS | Dahlke and Kass, 1991 | gas phase; Between iPrOH, MeCN. Reprotonation site uncertain.; B |
Quantity | Value | Units | Method | Reference | Comment |
ΔrG° | 1536. ± 17. | kJ/mol | IMRB | Dahlke and Kass, 1991 | gas phase; Between iPrOH, MeCN. Reprotonation site uncertain.; B |
By formula: C4H8S = C4H8S
Quantity | Value | Units | Method | Reference | Comment |
---|---|---|---|---|---|
ΔrH° | -13.9 ± 0.5 | kJ/mol | Eqk | Kimmelma, 1988 | liquid phase; solvent: DMSO; NMR; ALS |

Gas phase ion energetics data

Data compiled as indicated in comments:
B - John E. Bartmess
LLK - Sharon G. Lias, Rhoda D. Levin, and Sherif A. Kafafi
RDSH - Henry M. Rosenstock, Keith Draxl, Bruce W. Steiner, and John T. Herron
Ionization energy determinations
IE (eV) | Method | Reference | Comment |
---|---|---|---|
8.6 | PE | Schafer and Schweig, 1972 | LLK |
8.7 ± 0.2 | EI | Hobrock and Kiser, 1963 | RDSH |
8.65 | PE | Eaton and Traylor, 1974 | Vertical value; LLK |
Appearance energy determinations
Ion | AE (eV) | Other Products | Method | Reference | Comment |
---|---|---|---|---|---|
CHS+ | 13.8 ± 0.3 | ? | EI | Hobrock and Kiser, 1963 | RDSH |
CH2S+ | 11.4 ± 0.3 | ? | EI | Hobrock and Kiser, 1963 | RDSH |
CH3+ | 17.7 ± 0.5 | ? | EI | Hobrock and Kiser, 1963 | RDSH |
CH3S+ | 11.9 ± 0.2 | ? | EI | Hobrock and Kiser, 1963 | RDSH |
CH4S+ | 11.5 ± 0.2 | ? | EI | Hobrock and Kiser, 1963 | RDSH |
C2H3+ | 16.5 ± 0.4 | ? | EI | Hobrock and Kiser, 1963 | RDSH |
C2H5S+ | 12.0 ± 0.2 | ? | EI | Hobrock and Kiser, 1963 | RDSH |
C3H+ | 16.6 ± 0.5 | ? | EI | Hobrock and Kiser, 1963 | RDSH |
C3H2+ | 20.3 | ? | EI | Hobrock and Kiser, 1963 | RDSH |
C3H3+ | 16.5 ± 0.4 | ? | EI | Hobrock and Kiser, 1963 | RDSH |
C3H5+ | 12.7 ± 0.3 | ? | EI | Hobrock and Kiser, 1963 | RDSH |
C3H5S+ | 11.0 ± 0.2 | CH3 | EI | Hobrock and Kiser, 1963 | RDSH |
De-protonation reactions
C4H7S- + =
By formula: C4H7S- + H+ = C4H8S
Quantity | Value | Units | Method | Reference | Comment |
---|---|---|---|---|---|
ΔrH° | 1563. ± 17. | kJ/mol | G+TS | Dahlke and Kass, 1991 | gas phase; Between iPrOH, MeCN. Reprotonation site uncertain.; B |
Quantity | Value | Units | Method | Reference | Comment |
ΔrG° | 1536. ± 17. | kJ/mol | IMRB | Dahlke and Kass, 1991 | gas phase; Between iPrOH, MeCN. Reprotonation site uncertain.; B |

Kovats' RI, non-polar column, isothermal

Column type | Active phase | Temperature (C) | I | Reference | Comment |
---|---|---|---|---|---|
Packed | Apiezon M | 130. | 697. | Garbuzov, Misharina, et al., 1985 | He or N2, Chromosorb W, AW-DMCS; Column length: 2.1 m |
Packed | Apiezon M | 130. | 697. | Golovnya, Misharina, et al., 1978 | Chromosorb W, AW-DMCS; Column length: 2.1 m |

Van Den Dool and Kratz RI, non-polar column, temperature ramp

Column type | Active phase | I | Reference | Comment |
---|---|---|---|---|
Capillary | DB-1 | 678. | Yu, Lin, et al., 1994 | 60. m/0.25 mm/1.0 μm, He, 40. C @ 5. min, 2. K/min, 260. C @ 60. min |
Capillary | OV-1 | 678. | Schreyen, Dirinck, et al., 1976 | N2, 1. K/min; Column length: 183. m; Tstart: 0. C; Tend: 230. C |

Van Den Dool and Kratz RI, non-polar column, custom temperature program

Column type | Active phase | I | Reference | Comment |
---|---|---|---|---|
Capillary | SPB-1 | 684. | Mochizuki, Yamamoto, et al., 1998 | 30. m/0.32 mm/4.0 μm, N2; Program: 40 0C (10 min), 2 0C/min to 180 0C, 25 0C/min to 250 0C (5 min) |

Van Den Dool and Kratz RI, polar column, temperature ramp

Column type | Active phase | I | Reference | Comment |
---|---|---|---|---|
Capillary | FFAP | 960. | Calvo-Gómez, Morales-López, et al., 2004 | 30. m/0.25 mm/0.25 μm, He, 40. C @ 3. min, 5. K/min; Tend: 220. C |
Capillary | HP-Innowax | 976. | Storsberg, Schulz, et al., 2004 | 60. m/0.25 mm/0.5 μm, H2, 10. K/min; Tstart: 35. C; Tend: 220. C |
Capillary | DB-Wax | 948. | Cha, Kim, et al., 1998 | 60. m/0.25 mm/0.25 μm, 40. C @ 5. min, 3. K/min, 200. C @ 60. min |
Capillary | DB-Wax | 943. | Cha, Kim, et al., 1998 | 30. m/0.32 mm/0.25 μm, He, 40. C @ 5. min, 6. K/min, 200. C @ 30. min |
Capillary | CP-Wax 52CB | 960. | Kim, Wu, et al., 1995 | N2, 60. C @ 4. min, 2. K/min, 200. C @ 30. min; Column length: 50. m; Column diameter: 0.25 mm |
Capillary | CP-Wax 52CB | 960. | Kim, Wu, et al., 1995 | N2, 60. C @ 4. min, 2. K/min, 200. C @ 30. min; Column length: 50. m; Column diameter: 0.25 mm |
Capillary | CP-Wax 52CB | 932. | Yu, Wu, et al., 1993 | 50. m/0.32 mm/0.25 μm, H2, 40. C @ 10. min, 1.5 K/min, 200. C @ 60. min |
Capillary | CP-Wax 52CB | 956. | Yu, Wu, et al., 1989 | N2, 2. K/min; Column length: 50. m; Column diameter: 0.22 mm; Tstart: 50. C; Tend: 200. C |
Capillary | CP-Wax 52CB | 956. | Yu, Wu, et al., 1989, 2 | N2, 2. K/min; Column length: 50. m; Column diameter: 0.22 mm; Tstart: 50. C; Tend: 200. C |

Van Den Dool and Kratz RI, polar column, custom temperature program

Column type | Active phase | I | Reference | Comment |
---|---|---|---|---|
Capillary | Supelcowax-10 | 956. | Bianchi, Cantoni, et al., 2007 | 30. m/0.25 mm/0.25 μm; Program: 35C(8min) => 4C/min => 60C => 6C/min => 160C => 20C/min => 220C(1min) |
Capillary | Supelcowax-10 | 956. | Bianchi, Careri, et al., 2007 | 30. m/0.25 mm/0.25 μm, He; Program: 35C(8min) => 4C/min => 60C => 6C/min => 160C => 20C/min => 200C(1min) |

Normal alkane RI, non-polar column, temperature ramp

Column type | Active phase | I | Reference | Comment |
---|---|---|---|---|
Capillary | DB-5 | 701. | Meynier, Novelli, et al., 1999 | 30. m/0.32 mm/1. μm, 40. C @ 5. min, 3. K/min; Tend: 200. C |

Normal alkane RI, non-polar column, custom temperature program

Column type | Active phase | I | Reference | Comment |
---|---|---|---|---|
Capillary | HP-5 | 698. | Rotsatschakul, Visesanguan, et al., 2009 | 60. m/0.25 mm/0.25 μm, Helium; Program: 30 0C (2 min) 2 0Cmin -> 60 0C 10 0C/min -> 100 0C 20 0C/min -> 140 0C 10 0C/min -> 200 0C (10 min) |
Capillary | DB-5 | 696. | Mateo and Zumalacárregui, 1996 | 50. m/0.32 mm/0.25 μm, He; Program: 40C (10min) => 3C/min => 95C => 10C/min => 270C (10min) |
Capillary | DB-5 | 697. | Mateo and Zumalacárregui, 1996 | 50. m/0.32 mm/0.25 μm, He; Program: 40C (10min) => 3C/min => 95C => 10C/min => 270C (10min) |
Capillary | DB-5 | 697. | Mateo and Zumalacárregui, 1996 | 50. m/0.32 mm/0.25 μm, He; Program: 40C (10min) => 3C/min => 95C => 10C/min => 270C (10min) |

References

Weast and Grasselli, 1989
CRC Handbook of Data on Organic Compounds, 2nd Editon, Weast,R.C and Grasselli, J.G., ed(s)., CRC Press, Inc., Boca Raton, FL, 1989, 1. [all data]
American Tokyo Kasei, 1988
American Tokyo Kasei,
TCI American Organic Chemical 88/89 Catalog, American Tokyo Kasei, Portland, OR, 1988, 1610. [all data]
Dahlke and Kass, 1991
Dahlke, G.D.; Kass, S.R.,
Substituent Effects in the Gas Phase - 1-Substituted Allyl Anions,
J. Am. Chem. Soc., 1991, 113, 15, 5566, https://doi.org/10.1021/ja00015a008
. [all data]
Kimmelma, 1988
Kimmelma, R.,
Structure-stability relationships in vinyl sulfides. III. Stabilization caused by different alkylthio and phenylthio groups attached to an olefinic double bond,
Acta Chem. Scand., 1988, 42, 550-555. [all data]
Schafer and Schweig, 1972
Schafer, W.; Schweig, A.,
Evidence against the significance of C-S hyperconjugation in determining the conformation of allyl methyl sulphide,
J. Chem. Soc., Chem. Commun., 1972, 824. [all data]
Hobrock and Kiser, 1963
Hobrock, B.G.; Kiser, R.W.,
Electron impact investigations of sulfur compounds. II. 3-Methyl-2-thiabutane, 4-thia-1-pentene, and 3,4-dithiahexane,
J. Phys. Chem., 1963, 67, 648. [all data]
Eaton and Traylor, 1974
Eaton, D.F.; Traylor, T.G.,
Distortional stabilization in phenyl participations,
J. Am. Chem. Soc., 1974, 96, 7109. [all data]
Garbuzov, Misharina, et al., 1985
Garbuzov, V.G.; Misharina, T.A.; Aerov, A.F.; Golovnya, R.V.,
Gas chromatographic retention indices for sulphur(II)-containing organic substances,
J. Anal. Chem. USSR (Engl. Transl.), 1985, 40, 4, 576-586. [all data]
Golovnya, Misharina, et al., 1978
Golovnya, R.V.; Misharina, T.A.; Garbuzov, V.G.,
Gas chromatographic characterization of sulfur-containing compounds. 4. The effect of unsaturated radicals on the retention indices of the vinyl, allyl, and propargyl alkyl sulfides,
Izv. Akad. Nauk SSSR Ser. Khim., 1978, 11, 2266-2270. [all data]
Yu, Lin, et al., 1994
Yu, T.-H.; Lin, L.-Y.; Ho, C.-T.,
Volatile compounds of blanched, fried blanched, and baked blanched garlic slices,
J. Agric. Food Chem., 1994, 42, 6, 1342-1347, https://doi.org/10.1021/jf00042a018
. [all data]
Schreyen, Dirinck, et al., 1976
Schreyen, L.; Dirinck, P.; van Wassenhove, F.; Schamp, N.,
Volatile flavor components of leek,
J. Agric. Food Chem., 1976, 24, 2, 336-341, https://doi.org/10.1021/jf60204a056
. [all data]
Mochizuki, Yamamoto, et al., 1998
Mochizuki, E.; Yamamoto, T.; Komiyama, Y.; Nakazawa, H.,
Identification of allium products using flame photometric detection gas chromatography and distribution patterns of volatile sulfur compounds,
J. Agric. Food Chem., 1998, 46, 12, 5170-5176, https://doi.org/10.1021/jf9803076
. [all data]
Calvo-Gómez, Morales-López, et al., 2004
Calvo-Gómez, O.; Morales-López, J.; López, M.G.,
Solid-phase microextraction-gas chromatographic-mass spectrometric analysis of garlic oil obtained by hydrodistillation,
J. Chromatogr. A, 2004, 1036, 1, 91-93, https://doi.org/10.1016/j.chroma.2004.02.072
. [all data]
Storsberg, Schulz, et al., 2004
Storsberg, J.; Schulz, H.; Keusgen, M.; Tannous, F.; Dehmer, K.J.; Joachim Keller, E.R.,
Chemical characterization of interspecific hybrids between Allium cepa L. and Allium kermesinum Rchb.,
J. Agric. Food Chem., 2004, 52, 17, 5499-5505, https://doi.org/10.1021/jf049684a
. [all data]
Cha, Kim, et al., 1998
Cha, Y.J.; Kim, H.; Cadwallader, K.R.,
Aroma-active compounds in Kimchi during fermentation,
J. Agric. Food Chem., 1998, 46, 5, 1944-1953, https://doi.org/10.1021/jf9706991
. [all data]
Kim, Wu, et al., 1995
Kim, S.M.; Wu, C.M.; Kubota, K.; Kobayashi, A.,
Effect of soybean oil on garlic volatile compounds isoalted by distillation,
J. Agric. Food Chem., 1995, 43, 2, 449-452, https://doi.org/10.1021/jf00050a036
. [all data]
Yu, Wu, et al., 1993
Yu, T.-H.; Wu, C.-M.; Ho, C.-T.,
Volatile compounds of deep-oil fried, microwave-heated, and oven-baked garlic slices,
J. Agric. Food Chem., 1993, 41, 5, 800-805, https://doi.org/10.1021/jf00029a023
. [all data]
Yu, Wu, et al., 1989
Yu, T.-H.; Wu, C.-M.; Liou, Y.-C.,
Volatile compounds from garlic,
J. Agric. Food Chem., 1989, 37, 3, 725-730, https://doi.org/10.1021/jf00087a032
. [all data]
Yu, Wu, et al., 1989, 2
Yu, T.-H.; Wu, C.-M.; Chen, S.-Y.,
Effects of pH adjustment and heat treatment on the stability and the formation of volatile compounds of garlic,
J. Agric. Food Chem., 1989, 37, 3, 730-734, https://doi.org/10.1021/jf00087a033
. [all data]
Bianchi, Cantoni, et al., 2007
Bianchi, F.; Cantoni, C.; Careri, M.; Chiesa, L.; Musci, M.; Pinna, A.,
Characterization of the aromatic profile for the authentication and differentiation of typical Italian dry-sausages,
Talanta, 2007, 72, 4, 1552-1563, https://doi.org/10.1016/j.talanta.2007.02.019
. [all data]
Bianchi, Careri, et al., 2007
Bianchi, F.; Careri, M.; Mangia, A.; Musci, M.,
Retention indices in the analysis of food aroma volatile compounds in temperature-programmed gas chromatography: Database creation and evaluation of precision and robustness,
J. Sep. Sci., 2007, 39, 4, 563-572, https://doi.org/10.1002/jssc.200600393
. [all data]
Meynier, Novelli, et al., 1999
Meynier, A.; Novelli, E.; Chissolinim, R.; Zanardi, E.; Gandemer, G.,
Volatile compounds of commercial Milano salami,
Meat Sci., 1999, 51, 2, 175-183, https://doi.org/10.1016/S0309-1740(98)00122-3
. [all data]
Rotsatschakul, Visesanguan, et al., 2009
Rotsatschakul, P.; Visesanguan, W.; Smitinont, T.; Chaiseri, S.,
Changes in volatile compounds during fermentation of nham (Thai fermented sausage),
Int. Food Res. J., 2009, 16, 391-414. [all data]
Mateo and Zumalacárregui, 1996
Mateo, J.; Zumalacárregui, J.M.,
Volatile compounds in chorizo and their changes during ripening,
Meat Sci., 1996, 44, 4, 255-273, https://doi.org/10.1016/S0309-1740(96)00028-9
. [all data]