Methylthioacetylene
- Formula: C3H4S
- Molecular weight: 72.129
- IUPAC Standard InChIKey: UKRQTFFXHDKAMD-UHFFFAOYSA-N
- CAS Registry Number: 10152-75-7
- Chemical structure:
View 3d structure (requires JavaScript / HTML 5) - Permanent link for this species. Use this link for bookmarking this species for future reference.

Gas phase ion energetics data

Data compiled as indicated in comments:
LLK - Sharon G. Lias, Rhoda D. Levin, and Sherif A. Kafafi
Ionization energy determinations
IE (eV) | Method | Reference | Comment |
---|---|---|---|
8.3 | PE | Bock, Ried, et al., 1981 | LLK |
8.81 | PE | Bock, Ried, et al., 1981 | Vertical value; LLK |

References

Bock, Ried, et al., 1981
Bock, H.; Ried, W.; Stein, U.,
Analyse und optimierung von gasphasen-reaktionen, 19. Pyrolyse von cyclobuten-1,2-dionen zu acetylenen,
Chem. Ber., 1981, 114, 673. [all data]