Benzene, 1,3-bis(1,1-dimethylethyl)-
- Formula: C14H22
- Molecular weight: 190.3245
- IUPAC Standard InChIKey: ILNDSSCEZZFNGE-UHFFFAOYSA-N
- CAS Registry Number: 1014-60-4
- Chemical structure:
View 3d structure (requires JavaScript / HTML 5) - Other names: Benzene, m-di-tert-butyl-; m-Di-tert-butylbenzene; 1,3-Di-tert-butylbenzene; 1,3-Ditertiarybutylbenzene; 1,3-bis(1,1-Dimethylethyl)benzene

Condensed phase thermochemistry data

Data compiled by: Hussein Y. Afeefy, Joel F. Liebman, and Stephen E. Stein
Quantity | Value | Units | Method | Reference | Comment |
---|---|---|---|---|---|
ΔfH°liquid | -187.4 ± 1.5 | kJ/mol | Eqk | Nesterova, Verevkin, et al., 1984 | GLC |

Phase change data

Data compiled as indicated in comments:
BS - Robert L. Brown and Stephen E. Stein
AC - William E. Acree, Jr., James S. Chickos
Quantity | Value | Units | Method | Reference | Comment |
---|---|---|---|---|---|
ΔvapH° | 59.6 ± 0.5 | kJ/mol | N/A | Verevkin, 1998 | AC |
Reduced pressure boiling point
Tboil (K) | Pressure (bar) | Reference | Comment |
---|---|---|---|
379.7 | 0.024 | Aldrich Chemical Company Inc., 1990 | BS |
Enthalpy of vaporization
ΔvapH (kJ/mol) | Temperature (K) | Method | Reference | Comment |
---|---|---|---|---|
58.9 ± 0.5 | 310. | GS | Verevkin, 1998 | Based on data from 288. to 333. K.; AC |
58.0 | 360. | A | Stephenson and Malanowski, 1987 | Based on data from 346. to 374. K.; AC |

Reaction thermochemistry data

Data compiled by: Hussein Y. Afeefy, Joel F. Liebman, and Stephen E. Stein
Individual Reactions
By formula: C18H30 + C10H14 = C14H22 + C14H22
Quantity | Value | Units | Method | Reference | Comment |
---|---|---|---|---|---|
ΔrH° | 1.0 ± 1.1 | kJ/mol | Eqk | Nesterova, Verevkin, et al., 1984 | liquid phase; GLC |
By formula: C14H22 = C14H22
Quantity | Value | Units | Method | Reference | Comment |
---|---|---|---|---|---|
ΔrH° | 93. ± 2. | kJ/mol | Eqk | Arnett, Sanda, et al., 1967 | liquid phase; solvent: CS2 |
By formula: C14H22 + C6H6 = 2C10H14
Quantity | Value | Units | Method | Reference | Comment |
---|---|---|---|---|---|
ΔrH° | -3.02 ± 0.72 | kJ/mol | Eqk | Nesterova, Verevkin, et al., 1984 | liquid phase; GLC |
By formula: C14H22 = C14H22
Quantity | Value | Units | Method | Reference | Comment |
---|---|---|---|---|---|
ΔrH° | 1.48 ± 0.33 | kJ/mol | Eqk | Nesterova, Verevkin, et al., 1984 | liquid phase; GLC |

Gas phase ion energetics data

Data compiled as indicated in comments:
LBLHLM - Sharon G. Lias, John E. Bartmess, Joel F. Liebman, John L. Holmes, Rhoda D. Levin, and W. Gary Mallard
RDSH - Henry M. Rosenstock, Keith Draxl, Bruce W. Steiner, and John T. Herron
Ionization energy determinations
IE (eV) | Method | Reference | Comment |
---|---|---|---|
8.71 ± 0.07 | EI | Arnett, Sanda, et al., 1967, 2 | RDSH |
8.43 | PE | Howell, Goncalves, et al., 1984 | Vertical value; LBLHLM |
Appearance energy determinations
Ion | AE (eV) | Other Products | Method | Reference | Comment |
---|---|---|---|---|---|
C13H19+ | 11.70 ± 0.07 | CH3 | EI | Arnett, Sanda, et al., 1967, 2 | RDSH |

Normal alkane RI, non-polar column, custom temperature program

Column type | Active phase | I | Reference | Comment |
---|---|---|---|---|
Capillary | CP-Sil5 CB MS | 1245. | Iraqi, Vermeulen, et al., 2005 | 50. m/0.32 mm/1.2 μm; Program: 36C(2min) => 20C/min => 85C => 1C/min => 145C => 3C/min => 250C(30min) |
Capillary | CP-Sil5 CB MS | 1249. | Tirillini, Verdelli, et al., 2000 | 50. m/0.32 mm/0.4 μm; Program: 0C (3min) => 3C/min => 50C => 5C/min => 220C (30min) |

Normal alkane RI, polar column, isothermal

Column type | Active phase | Temperature (C) | I | Reference | Comment |
---|---|---|---|---|---|
Capillary | PEG-40M | 100. | 1426. | Nesterov, Nesterova, et al., 2000 | Column length: 50. m |
Capillary | PEG-40M | 100. | 1427. | Nesterov, Nesterova, et al., 2000 | Column length: 50. m |
Capillary | PEG-40M | 120. | 1436. | Nesterov, Nesterova, et al., 2000 | Column length: 50. m |
Capillary | PEG-40M | 140. | 1444. | Nesterov, Nesterova, et al., 2000 | Column length: 50. m |
Capillary | PEG-40M | 160. | 1454. | Nesterov, Nesterova, et al., 2000 | Column length: 50. m |
Capillary | PEG-40M | 80. | 1420. | Nesterov, Nesterova, et al., 2000 | Column length: 50. m |

References

Nesterova, Verevkin, et al., 1984
Nesterova, T.N.; Verevkin, S.R.; Karaseva, S.Ya.; Rozhnov, A.M.; Tsvetkov, V.F.,
The equilibria in the interconversions of t-butylbenzenes,
Russ. J. Phys. Chem. (Engl. Transl.), 1984, 58, 297-298. [all data]
Verevkin, 1998
Verevkin, Sergey P.,
Thermochemical properties of branched alkylsubstituted benzenes,
The Journal of Chemical Thermodynamics, 1998, 30, 8, 1029-1040, https://doi.org/10.1006/jcht.1998.0370
. [all data]
Aldrich Chemical Company Inc., 1990
Aldrich Chemical Company Inc.,
Catalog Handbook of Fine Chemicals, Aldrich Chemical Company, Inc., Milwaukee WI, 1990, 1. [all data]
Stephenson and Malanowski, 1987
Stephenson, Richard M.; Malanowski, Stanislaw,
Handbook of the Thermodynamics of Organic Compounds, 1987, https://doi.org/10.1007/978-94-009-3173-2
. [all data]
Arnett, Sanda, et al., 1967
Arnett, E.M.; Sanda, J.C.; Bollinger, J.M.; Barber, M.,
Crowded benzenes. VI. The strain energy in o-di-t-butylbenzenes,
J. Am. Chem. Soc., 1967, 89, 5389-5400. [all data]
Arnett, Sanda, et al., 1967, 2
Arnett, E.M.; Sanda, J.C.; Bollinger, J.M.; Barber, M.,
Crowded benzenes. VI. The strain energy in o-di-tbutylbenzenes,
J. Am. Chem. Soc., 1967, 89, 5389. [all data]
Howell, Goncalves, et al., 1984
Howell, J.O.; Goncalves, J.M.; Amatore, C.; Klasinc, L.; Wightman, R.M.; Kochi, J.K.,
Electron transfer from aromatic hydrocarbons and their π-complexes with metals. Comparison of the standard oxidation potentials and vertical ionization potentials,
J. Am. Chem. Soc., 1984, 106, 3968. [all data]
Iraqi, Vermeulen, et al., 2005
Iraqi, R.; Vermeulen, C.; Benzekri, A.; Bouseta, A.; Collin, S.,
Screening for key odorants in Moroccan green olives by gas chromatography-olfactometry/aroma extract dilution analysis,
J. Agric. Food Chem., 2005, 53, 4, 1179-1184, https://doi.org/10.1021/jf040349w
. [all data]
Tirillini, Verdelli, et al., 2000
Tirillini, B.; Verdelli, G.; Paolocci, F.; Ciccioli, P.; Frattoni, M.,
The volatile organic compounds from the mycelium of Tuber borchii Vitt.,
Phytochemistry, 2000, 55, 8, 983-985, https://doi.org/10.1016/S0031-9422(00)00308-3
. [all data]
Nesterov, Nesterova, et al., 2000
Nesterov, I.A.; Nesterova, T.N.; Pimerzin, A.A.; Tsvetkov, V.S.,
Thermodynamics of alkylbenzene sorption and evaporation. IV. Enthalpies of evaporation and thermodynamics chracteristics of sorption by stationary phases OV-101 and PEG-40M,
Izvestia vysshikh uchebnykh zavedenii. Khimia i khimicheskaia tekhnologia (Chemistry and chemical technology), 2000, 43, 4, 39-45. [all data]