Dibenzothiophene, 5-oxide
- Formula: C12H8OS
- Molecular weight: 200.256
- IUPAC Standard InChIKey: NGDPCAMPVQYGCW-UHFFFAOYSA-N
- CAS Registry Number: 1013-23-6
- Chemical structure:
View 3d structure (requires JavaScript / HTML 5) - Other names: Dibenzothiophene sulfoxide; Dibenzothiophene S-oxide

Gas phase ion energetics data

Data compiled as indicated in comments:
LLK - Sharon G. Lias, Rhoda D. Levin, and Sherif A. Kafafi
Ionization energy determinations
IE (eV) | Method | Reference | Comment |
---|---|---|---|
8.1 | PE | Bock and Solouki, 1974 | LLK |
8.43 | PE | Bock and Solouki, 1974 | Vertical value; LLK |

References

Bock and Solouki, 1974
Bock, H.; Solouki, B.,
Photoelektronenspektren und molekuleigenschaften, XXXV. Sulfoxide X2SO - beispiele fur den nutzen von korrelations - diagrammen bei der diskussion von substituenteneffekten und von geometrischen storungen,
Chem. Ber., 1974, 107, 2299. [all data]