1,2-Di-tert-butylbenzene
- Formula: C14H22
- Molecular weight: 190.3245
- IUPAC Standard InChIKey: SZURZHQMGVKJLV-UHFFFAOYSA-N
- CAS Registry Number: 1012-76-6
- Chemical structure:
View 3d structure (requires JavaScript / HTML 5) - Permanent link for this species. Use this link for bookmarking this species for future reference.

Phase change data

Data compiled by: Thermodynamics Research Center, NIST Boulder Laboratories, Chris Muzny director
Quantity | Value | Units | Method | Reference | Comment |
---|---|---|---|---|---|
Tfus | 300.15 | K | N/A | Arnett, Sanda, et al., 1967 | Uncertainty assigned by TRC = 0.6 K |

Reaction thermochemistry data

Data compiled by: Hussein Y. Afeefy, Joel F. Liebman, and Stephen E. Stein
Individual Reactions
By formula: C14H22 = C14H22
Quantity | Value | Units | Method | Reference | Comment |
---|---|---|---|---|---|
ΔrH° | 93. ± 2. | kJ/mol | Eqk | Arnett, Sanda, et al., 1967, 2 | liquid phase; solvent: CS2 |

Gas phase ion energetics data

Data compiled as indicated in comments:
RDSH - Henry M. Rosenstock, Keith Draxl, Bruce W. Steiner, and John T. Herron
Ionization energy determinations
IE (eV) | Method | Reference | Comment |
---|---|---|---|
8.60 ± 0.07 | EI | Arnett, Sanda, et al., 1967 | RDSH |
Appearance energy determinations
Ion | AE (eV) | Other Products | Method | Reference | Comment |
---|---|---|---|---|---|
C13H19+ | 10.64 ± 0.07 | CH3 | EI | Arnett, Sanda, et al., 1967 | RDSH |

References

Arnett, Sanda, et al., 1967
Arnett, E.M.; Sanda, J.C.; Bollinger, J.M.; Barber, M.,
Crowded benzenes. VI. The strain energy in o-di-tbutylbenzenes,
J. Am. Chem. Soc., 1967, 89, 5389. [all data]
Arnett, Sanda, et al., 1967, 2
Arnett, E.M.; Sanda, J.C.; Bollinger, J.M.; Barber, M.,
Crowded benzenes. VI. The strain energy in o-di-t-butylbenzenes,
J. Am. Chem. Soc., 1967, 89, 5389-5400. [all data]