(E)-3-(2-Methoxyphenyl)-2-propenoic acid
- Formula: C10H10O3
- Molecular weight: 178.1846
- IUPAC Standard InChIKey: FEGVSPGUHMGGBO-VOTSOKGWSA-N
- CAS Registry Number: 1011-54-7
- Chemical structure:
View 3d structure (requires JavaScript / HTML 5) - Stereoisomers:
- Other names: 2-Propenoic acid, 3-(2-methoxyphenyl)-, (E)-; (E)-o-methoxycinnamic acid

Phase change data

Data compiled by: William E. Acree, Jr., James S. Chickos
Quantity | Value | Units | Method | Reference | Comment |
---|---|---|---|---|---|
ΔsubH° | 128.8 ± 0.6 | kJ/mol | ME | Monte and Hillesheim, 1999 | Based on data from 368. to 382. K. |

Gas phase ion energetics data

Data compiled as indicated in comments:
LBLHLM - Sharon G. Lias, John E. Bartmess, Joel F. Liebman, John L. Holmes, Rhoda D. Levin, and W. Gary Mallard
Ionization energy determinations
IE (eV) | Method | Reference | Comment |
---|---|---|---|
8.50 | EI | Schaldach, 1984 | LBLHLM |

References

Monte and Hillesheim, 1999
Monte, Manuel J.S.; Hillesheim, Dorothea M.,
Vapour pressures, enthalpies and entropies of sublimation of trans -cinnamic acid and of nine methoxy and dimethoxycinnamic acids,
The Journal of Chemical Thermodynamics, 1999, 31, 11, 1443-1456, https://doi.org/10.1006/jcht.1999.0540
. [all data]
Schaldach, 1984
Schaldach, B.,
Chemistry of gaseous ions. Part VIII. Bond strength and mass spectrometric fragmentation of 2-methoxycinnamic acid,
Int. J. Mass Spectrom. Ion Processes, 1984, 56, 237. [all data]