Phosphorous acid, triphenyl ester
- Formula: C18H15O3P
- Molecular weight: 310.2837
- IUPAC Standard InChIKey: HVLLSGMXQDNUAL-UHFFFAOYSA-N
- CAS Registry Number: 101-02-0
- Chemical structure:

Gas phase ion energetics data

Data compiled as indicated in comments:
LLK - Sharon G. Lias, Rhoda D. Levin, and Sherif A. Kafafi
RDSH - Henry M. Rosenstock, Keith Draxl, Bruce W. Steiner, and John T. Herron
Ionization energy determinations
IE (eV) | Method | Reference | Comment |
---|---|---|---|
8.60 | EI | Muller and Fenderl, 1969 | RDSH |
8.80 | PE | Daamen, Oskam, et al., 1980 | Vertical value; LLK |

References

Muller and Fenderl, 1969
Muller, J.; Fenderl, K.,
Massenspektren und Ionisierungspotentiale von C5H5Mn(CO)2PX3-Komplexen,
J. Organometal. Chem., 1969, 19, 123. [all data]
Daamen, Oskam, et al., 1980
Daamen, H.; Oskam, A.; Stufkens, D.J.,
U.V. photoelectron (He I and He II) studies of M(CO)5PR3 (M = Cr, W and R = C6H11, C6H5, O-i-C3H7, OC6H5) and W(CO)5As(C6H5)3,
Inorg. Chim. Acta, 1980, 38, 71. [all data]