lead diiodide
- Formula: I2Pb
- Molecular weight: 461.0
- CAS Registry Number: 10101-63-0

Condensed phase thermochemistry data

Quantity | Value | Units | Method | Reference | Comment |
---|---|---|---|---|---|
ΔfH°liquid | -157.68 | kJ/mol | Review | Chase, 1998 | Data last reviewed in December, 1973 |
Quantity | Value | Units | Method | Reference | Comment |
S°liquid,1 bar | 198.90 | J/mol*K | Review | Chase, 1998 | Data last reviewed in December, 1973 |
Quantity | Value | Units | Method | Reference | Comment |
ΔfH°solid | -175.39 | kJ/mol | Review | Chase, 1998 | Data last reviewed in December, 1973 |
Quantity | Value | Units | Method | Reference | Comment |
S°solid | 174.84 | J/mol*K | Review | Chase, 1998 | Data last reviewed in December, 1973 |
Liquid Phase Heat Capacity (Shomate Equation)
Cp° = A + B*t + C*t2 + D*t3 +
E/t2
H° − H°298.15= A*t + B*t2/2 +
C*t3/3 + D*t4/4 − E/t + F − H
S° = A*ln(t) + B*t + C*t2/2 + D*t3/3 −
E/(2*t2) + G
Cp = heat capacity (J/mol*K)
H° = standard enthalpy (kJ/mol)
S° = standard entropy (J/mol*K)
t = temperature (K) / 1000.
View plot Requires a JavaScript / HTML 5 canvas capable browser.
Temperature (K) | 683. to 1500. |
---|---|
A | 108.5752 |
B | -1.854976×10-7 |
C | 1.548858×10-7 |
D | -4.363954×10-8 |
E | -4.700347×10-9 |
F | -194.8941 |
G | 317.2915 |
H | -157.6791 |
Reference | Chase, 1998 |
Comment | Data last reviewed in December, 1973 |
Solid Phase Heat Capacity (Shomate Equation)
Cp° = A + B*t + C*t2 + D*t3 +
E/t2
H° − H°298.15= A*t + B*t2/2 +
C*t3/3 + D*t4/4 − E/t + F − H
S° = A*ln(t) + B*t + C*t2/2 + D*t3/3 −
E/(2*t2) + G
Cp = heat capacity (J/mol*K)
H° = standard enthalpy (kJ/mol)
S° = standard entropy (J/mol*K)
t = temperature (K) / 1000.
View plot Requires a JavaScript / HTML 5 canvas capable browser.
Temperature (K) | 298. to 683. |
---|---|
A | 133.2817 |
B | -221.8980 |
C | 304.1651 |
D | -104.2582 |
E | -1.228980 |
F | -211.8723 |
G | 382.7753 |
H | -175.3933 |
Reference | Chase, 1998 |
Comment | Data last reviewed in December, 1973 |

Phase change data

Data compiled by: William E. Acree, Jr., James S. Chickos
Quantity | Value | Units | Method | Reference | Comment |
---|---|---|---|---|---|
ΔsubH° | 170. ± 10. | kJ/mol | AVG | N/A | Average of 6 values; Individual data points |

Gas phase ion energetics data

Data compiled as indicated in comments:
LBLHLM - Sharon G. Lias, John E. Bartmess, Joel F. Liebman, John L. Holmes, Rhoda D. Levin, and W. Gary Mallard
LLK - Sharon G. Lias, Rhoda D. Levin, and Sherif A. Kafafi
Ionization energy determinations
IE (eV) | Method | Reference | Comment |
---|---|---|---|
8.86 ± 0.03 | PI | Berkowitz, 1971 | LLK |
8.90 | PE | Novak and Potts, 1984 | Vertical value; LBLHLM |

Gas phase thermochemistry data

Quantity Value Units Method Reference Comment
Δfgas-0.760kcal/molReviewChase, 1998Data last reviewed in December, 1973
Quantity Value Units Method Reference Comment
gas,1 bar85.935cal/mol*KReviewChase, 1998Data last reviewed in December, 1973

Gas Phase Heat Capacity (Shomate Equation)

Cp° = A + B*t + C*t2 + D*t3 + E/t2
H° − H°298.15= A*t + B*t2/2 + C*t3/3 + D*t4/4 − E/t + F − H
S° = A*ln(t) + B*t + C*t2/2 + D*t3/3 − E/(2*t2) + G
    Cp = heat capacity (cal/mol*K)
    H° = standard enthalpy (kcal/mol)
    S° = standard entropy (cal/mol*K)
    t = temperature (K) / 1000.

View plot Requires a JavaScript / HTML 5 canvas capable browser.

View table.

Temperature (K) 1500. - 6000.
A 13.90900
B 0.001165
C -0.000306
D 0.000025
E -0.012377
F -4.948590
G 102.6970
H -0.760039
ReferenceChase, 1998
Comment Data last reviewed in December, 1973

References

Chase, 1998
Chase, M.W., Jr.,
NIST-JANAF Themochemical Tables, Fourth Edition,
J. Phys. Chem. Ref. Data, Monograph 9, 1998, 1-1951. [all data]
Berkowitz, 1971
Berkowitz, J.,
Photoionization mass spectrometry photoelectron spectroscopy of high temperature vapor,
Adv. High Temp. Chem., 1971, 3, 123. [all data]
Novak and Potts, 1984
Novak, I.; Potts, A.W.,
Ultraviolet photoelectron spectra of gas phase and condensed tin and lead dihalides (MX2, M = Sn, Pb X = Cl, Br, I),
J. Electron Spectrosc. Relat. Phenom., 1984, 33, 1. [all data]