lutetium trichloride
- Formula: Cl3Lu
- Molecular weight: 281.326
- CAS Registry Number: 10099-66-8

Reaction thermochemistry data

Data compiled by: John E. Bartmess
Individual Reactions
By formula: Cl- + Cl3Lu = (Cl- • Cl3Lu)
Quantity | Value | Units | Method | Reference | Comment |
---|---|---|---|---|---|
ΔrH° | 71.0 ± 3.6 | kcal/mol | TDAs | Pogrebnoi, Kudion, et al., 1997 | gas phase; EA estimated as 3.7±1.0 eV; value altered from reference due to conversion from electron convention to ion convention |
ΔrH° | 85.8 ± 2.4 | kcal/mol | TDEq | Kudin, Vorob'ev, et al., 2007 | gas phase; value altered from reference due to conversion from electron convention to ion convention |
By formula: Cl4Lu- + Cl3Lu = Cl7Lu2-
Quantity | Value | Units | Method | Reference | Comment |
---|---|---|---|---|---|
ΔrH° | 49.5 ± 2.4 | kcal/mol | TDAs | Pogrebnoi, Kudion, et al., 1997 | gas phase; value altered from reference due to conversion from electron convention to ion convention |
ΔrH° | 61.2 ± 7.9 | kcal/mol | TDEq | Kudin, Vorob'ev, et al., 2007 | gas phase; value altered from reference due to conversion from electron convention to ion convention |
By formula: Cl7Lu2- + 2Cl3Lu = Cl10Lu3-
Quantity | Value | Units | Method | Reference | Comment |
---|---|---|---|---|---|
ΔrH° | 57.8 ± 7.6 | kcal/mol | TDAs | Pogrebnoi, Kudion, et al., 1997 | gas phase; value altered from reference due to conversion from electron convention to ion convention |
By formula: Cl10Lu3- + 3Cl3Lu = Cl13Lu4-
Quantity | Value | Units | Method | Reference | Comment |
---|---|---|---|---|---|
ΔrH° | 75.3 ± 5.3 | kcal/mol | TDAs | Pogrebnoi, Kudion, et al., 1997 | gas phase; value altered from reference due to conversion from electron convention to ion convention |
By formula: Cl13Lu4- + 4Cl3Lu = Cl16Lu5-
Quantity | Value | Units | Method | Reference | Comment |
---|---|---|---|---|---|
ΔrH° | 45. ± 19. | kcal/mol | TDAs | Pogrebnoi, Kudion, et al., 1997 | gas phase; value altered from reference due to conversion from electron convention to ion convention |
By formula: Cl16Lu5- + 5Cl3Lu = Cl19Lu6-
Quantity | Value | Units | Method | Reference | Comment |
---|---|---|---|---|---|
ΔrH° | 95. ± 23. | kcal/mol | TDAs | Pogrebnoi, Kudion, et al., 1997 | gas phase; value altered from reference due to conversion from electron convention to ion convention |

Gas phase ion energetics data

Data compiled as indicated in comments:
LBLHLM - Sharon G. Lias, John E. Bartmess, Joel F. Liebman, John L. Holmes, Rhoda D. Levin, and W. Gary Mallard
RDSH - Henry M. Rosenstock, Keith Draxl, Bruce W. Steiner, and John T. Herron
Ionization energy determinations
IE (eV) | Method | Reference | Comment |
---|---|---|---|
11.5 ± 0.5 | EI | Hastie, Ficalora, et al., 1968 | RDSH |
11.55 ± 0.04 | PE | Lee, Potts, et al., 1982 | Vertical value; LBLHLM |
Appearance energy determinations
Ion | AE (eV) | Other Products | Method | Reference | Comment |
---|---|---|---|---|---|
LuCl+ | 16.0 ± 0.5 | ? | EI | Hastie, Ficalora, et al., 1968 | RDSH |
LuCl2+ | 12.5 ± 0.3 | Cl | EI | Hastie, Ficalora, et al., 1968 | RDSH |
Lu+ | 20.5 ± 0.5 | ? | EI | Hastie, Ficalora, et al., 1968 | RDSH |

Ion clustering data

Data compiled by: John E. Bartmess
Clustering reactions
By formula: Cl- + Cl3Lu = (Cl- • Cl3Lu)
Quantity | Value | Units | Method | Reference | Comment |
---|---|---|---|---|---|
ΔrH° | 71.0 ± 3.6 | kcal/mol | TDAs | Pogrebnoi, Kudion, et al., 1997 | gas phase; EA estimated as 3.7±1.0 eV; value altered from reference due to conversion from electron convention to ion convention |
ΔrH° | 85.8 ± 2.4 | kcal/mol | TDEq | Kudin, Vorob'ev, et al., 2007 | gas phase; value altered from reference due to conversion from electron convention to ion convention |
By formula: Cl4Lu- + Cl3Lu = Cl7Lu2-
Quantity | Value | Units | Method | Reference | Comment |
---|---|---|---|---|---|
ΔrH° | 49.5 ± 2.4 | kcal/mol | TDAs | Pogrebnoi, Kudion, et al., 1997 | gas phase; value altered from reference due to conversion from electron convention to ion convention |
ΔrH° | 61.2 ± 7.9 | kcal/mol | TDEq | Kudin, Vorob'ev, et al., 2007 | gas phase; value altered from reference due to conversion from electron convention to ion convention |
By formula: Cl7Lu2- + 2Cl3Lu = Cl10Lu3-
Quantity | Value | Units | Method | Reference | Comment |
---|---|---|---|---|---|
ΔrH° | 57.8 ± 7.6 | kcal/mol | TDAs | Pogrebnoi, Kudion, et al., 1997 | gas phase; value altered from reference due to conversion from electron convention to ion convention |
By formula: Cl10Lu3- + 3Cl3Lu = Cl13Lu4-
Quantity | Value | Units | Method | Reference | Comment |
---|---|---|---|---|---|
ΔrH° | 75.3 ± 5.3 | kcal/mol | TDAs | Pogrebnoi, Kudion, et al., 1997 | gas phase; value altered from reference due to conversion from electron convention to ion convention |
By formula: Cl13Lu4- + 4Cl3Lu = Cl16Lu5-
Quantity | Value | Units | Method | Reference | Comment |
---|---|---|---|---|---|
ΔrH° | 45. ± 19. | kcal/mol | TDAs | Pogrebnoi, Kudion, et al., 1997 | gas phase; value altered from reference due to conversion from electron convention to ion convention |
By formula: Cl16Lu5- + 5Cl3Lu = Cl19Lu6-
Quantity | Value | Units | Method | Reference | Comment |
---|---|---|---|---|---|
ΔrH° | 95. ± 23. | kcal/mol | TDAs | Pogrebnoi, Kudion, et al., 1997 | gas phase; value altered from reference due to conversion from electron convention to ion convention |

References

Pogrebnoi, Kudion, et al., 1997
Pogrebnoi, A.; Kudion, L.S.; Kuznetsov, A.Yu.; Butman, M.F.,
Molecular and Ionic Clusters in Saturated Vapor over Lutetium Trichloride,
Rapid Commun. Mass Spectrom., 1997, 11, 14, 1536, https://doi.org/10.1002/(SICI)1097-0231(199709)11:14<1536::AID-RCM31>3.0.CO;2-D
. [all data]
Kudin, Vorob'ev, et al., 2007
Kudin, L.S.; Vorob'ev, D.E.; Grishin, A.E.,
The Thermochemical Characteristics of the LnCl4- and Ln2Cl7- Negative Ions,
Russ. J. Phys. Chem., 2007, 81, 2, 147, https://doi.org/10.1134/S003602440702001X
. [all data]
Hastie, Ficalora, et al., 1968
Hastie, J.W.; Ficalora, P.; Margrave, J.L.,
Mass spectrometric studies at high temperatures. XXV. Vapor composition over LaCl3, EuCl3 and LuCl3 and stabilities of the trichloride dimers,
J. Less-Common Metals, 1968, 14, 83. [all data]
Lee, Potts, et al., 1982
Lee, E.P.F.; Potts, A.W.; Bloor, J.E.,
HeI and HeII photoelectron spectra of lanthanide trichlorides in the vapour phase,
Proc. R. Soc. London A, 1982, 381, 373. [all data]