Methenamine
- Formula: C6H12N4
- Molecular weight: 140.1863
- IUPAC Standard InChIKey: VKYKSIONXSXAKP-UHFFFAOYSA-N
- CAS Registry Number: 100-97-0
- Chemical structure:
View 3d structure (requires JavaScript / HTML 5) - Other names: 1,3,5,7-Tetraazaadamantane; 1,3,5,7-Tetraazatricyclo[3.3.1.13,7]decane; Hexamethylenetetramine; Aceto HMT; Aminoform; Aminoformaldehyde; Ammoform; Ammonioformaldehyde; Antihydral; Cystogen; Duirexol; Ekagom H; Formamine; Formin; Herax UTS; Heterin; Hexa-Flo-Pulver; Hexaform; Hexamine; Hexasan; Methenamin; Preparation AF; Uramin; Uratrine; Uritone; Urodeine; Urotropin; Urotropine; Xametrin; 1,3,5,7-Tetraazatricyclo-[3.3.1.1(3,7)]decane; Cystamin; Hexaloids; Hexamethylenetetraamine; Hexamethylentetramin; Hexilmethylenamine; Resotropin; Nocceler H; Vulkacit H 30; Hexa; H.M.T.; HMT; Metramine; Vesaloin; Formin (heterocycle); Hexamethylenamine; Hexamine (heterocycle); Sanceler H

Gas phase thermochemistry data

Data compiled as indicated in comments:
ALS - Hussein Y. Afeefy, Joel F. Liebman, and Stephen E. Stein
DRB - Donald R. Burgess, Jr.
Quantity | Value | Units | Method | Reference | Comment |
---|---|---|---|---|---|
ΔfH°gas | 199. ± 3. | kJ/mol | Ccr | Mansson, Rapport, et al., 1970 | ALS |
ΔfH°gas | 197.9 | kJ/mol | N/A | Delepine and Badoche, 1942 | Value computed using ΔfHsolid° value of 123.0 kj/mol from Delepine and Badoche, 1942 and ΔsubH° value of 74.9 kj/mol from Mansson, Rapport, et al., 1970.; DRB |

Condensed phase thermochemistry data

Data compiled as indicated in comments:
ALS - Hussein Y. Afeefy, Joel F. Liebman, and Stephen E. Stein
DH - Eugene S. Domalski and Elizabeth D. Hearing
Quantity | Value | Units | Method | Reference | Comment |
---|---|---|---|---|---|
ΔfH°solid | 124.1 ± 0.75 | kJ/mol | Ccr | Mansson, Rapport, et al., 1970 | ALS |
ΔfH°solid | 123.0 | kJ/mol | Ccb | Delepine and Badoche, 1942 | Author's hf298_condensed=27.10 kcal/mol; ALS |
Quantity | Value | Units | Method | Reference | Comment |
ΔcH°solid | -4200.11 ± 0.67 | kJ/mol | Ccr | Mansson, Rapport, et al., 1970 | ALS |
ΔcH°solid | -4199.1 | kJ/mol | Ccb | Delepine and Badoche, 1942 | Author's hf298_condensed=27.10 kcal/mol; ALS |
Quantity | Value | Units | Method | Reference | Comment |
S°solid,1 bar | 163.38 | J/mol*K | N/A | Westrum, 1961 | DH |
S°solid,1 bar | 163.38 | J/mol*K | N/A | Chang and Westrum, 1960 | DH |
Constant pressure heat capacity of solid
Cp,solid (J/mol*K) | Temperature (K) | Reference | Comment |
---|---|---|---|
152.29 | 298.15 | Westrum, 1961 | T = 5 to 350 K. Only value at 298.15 K given.; DH |
152.29 | 298.15 | Chang and Westrum, 1960 | T = 5 to 350 K.; DH |

Phase change data

Data compiled as indicated in comments:
AC - William E. Acree, Jr., James S. Chickos
ALS - Hussein Y. Afeefy, Joel F. Liebman, and Stephen E. Stein
DRB - Donald R. Burgess, Jr.
Quantity | Value | Units | Method | Reference | Comment |
---|---|---|---|---|---|
ΔsubH° | 79.6 ± 0.4 | kJ/mol | GS | Verevkin, 2002 | Based on data from 339. to 378. K.; AC |
ΔsubH° | 75. ± 3. | kJ/mol | V | Mansson, Rapport, et al., 1970 | ALS |
ΔsubH° | 74.9 | kJ/mol | N/A | Mansson, Rapport, et al., 1970 | DRB |
ΔsubH° | 74.9 ± 2.9 | kJ/mol | N/A | Wada, Kishida, et al., 1960 | See also Westrum, Mansson, et al., 1970.; AC |
Enthalpy of sublimation
ΔsubH (kJ/mol) | Temperature (K) | Method | Reference | Comment |
---|---|---|---|---|
77.7 ± 0.4 | 359. | GS | Verevkin, 2002 | Based on data from 339. to 378. K.; AC |
76.8 | 313. | A | Stephenson and Malanowski, 1987 | Based on data from 298. to 453. K.; AC |
78.8 | 316. | TE,ME | De Wit, Van Miltenburg, et al., 1983 | Based on data from 302. to 328. K.; AC |
74.1 ± 0.8 | 289. | TE | Budurov, 1960 | Based on data from 281. to 298. K.; AC |

Gas phase ion energetics data

Data compiled as indicated in comments:
LBLHLM - Sharon G. Lias, John E. Bartmess, Joel F. Liebman, John L. Holmes, Rhoda D. Levin, and W. Gary Mallard
LLK - Sharon G. Lias, Rhoda D. Levin, and Sherif A. Kafafi
RDSH - Henry M. Rosenstock, Keith Draxl, Bruce W. Steiner, and John T. Herron
Ionization energy determinations
IE (eV) | Method | Reference | Comment |
---|---|---|---|
8.26 | PE | Dewar and Worley, 1969 | RDSH |
8.55 | PE | Cowley, Lattman, et al., 1982 | Vertical value; LBLHLM |
8.53 | PE | Nelsen and Buschek, 1974 | Vertical value; LLK |

Normal alkane RI, non-polar column, custom temperature program

Column type | Active phase | I | Reference | Comment |
---|---|---|---|---|
Capillary | Nonpolar | 1204. | Staples and Zeiger, 2008 | Program: not specified |
Capillary | Nonpolar | 1205. | Staples and Zeiger, 2008 | Program: not specified |
Capillary | Nonpolar | 1220. | Staples and Zeiger, 2008 | Program: not specified |
Other | Methyl Silicone | 1210. | Ardrey and Moffat, 1981 | Program: not specified |

Normal alkane RI, polar column, custom temperature program

Column type | Active phase | I | Reference | Comment |
---|---|---|---|---|
Capillary | Superox 0.6; Carbowax 20M | 2014. | Waggott and Davies, 1984 | Hydrogen; Column length: 50. m; Column diameter: 0.32 mm; Program: not specified |
Capillary | Carbowax 400, Carbowax 20M, Carbowax 1540, Carbowax 4000, Superox 06, PEG 20M, etc. | 2014. | Waggott and Davies, 1984 | Hydrogen; Column length: 50. m; Column diameter: 0.32 mm; Program: not specified |

Lee's RI, non-polar column, temperature ramp

Column type | Active phase | I | Reference | Comment |
---|---|---|---|---|
Capillary | DB-5MS | 206.78 | Chen, Keeran, et al., 2002 | 30. m/0.25 mm/0.5 μm, 40. C @ 1. min, 10. K/min; Tend: 310. C |

References

Mansson, Rapport, et al., 1970
Mansson, M.; Rapport, N.; Westrum, E.F., Jr.,
Enthalpies of formation of globular molecules. I. Adamantane and hexamethylenetetramine,
J. Am. Chem. Soc., 1970, 92, 7296-7299. [all data]
Delepine and Badoche, 1942
Delepine, M.; Badoche, M.,
Thermochimie de l'aldehyde formique, de l'hexamethylene-tetramine et de ses derive,
C. R. Acad. Sci. Paris, 1942, 214, 777-780. [all data]
Westrum, 1961
Westrum, E.F., Jr.,
The thermophysical properties of three globular molecules,
J. Phys. Chem. Solids, 1961, 18, 83-85. [all data]
Chang and Westrum, 1960
Chang, S.-S.; Westrum, E.F., Jr.,
Heat capacities and thermodynamic properties of globular molecules. I. Adamantane and hexamethylenetetramine,
J. Phys. Chem., 1960, 64, 1547-1551. [all data]
Verevkin, 2002
Verevkin, Sergey P.,
Relationships among strain energies of mono- and poly-cyclic cyclohexanoid molecules and strain of their component rings,
The Journal of Chemical Thermodynamics, 2002, 34, 2, 263-275, https://doi.org/10.1006/jcht.2001.0896
. [all data]
Wada, Kishida, et al., 1960
Wada, Tadayoshi; Kishida, Etsuko; Tomiie, Yujiro; Suga, Hiroshi; Seki, Syûzô; Nitta, Isamu,
Crystal Structure and Thermodynamical Investigations of Triethylenediamine, C6H12N2,
Bull. Chem. Soc. Jpn., 1960, 33, 9, 1317-1318, https://doi.org/10.1246/bcsj.33.1317
. [all data]
Westrum, Mansson, et al., 1970
Westrum, Edgar F.; Mansson, Margret.; Rapport, Naomi.,
Enthalpies of formation of globular molecules. I. Adamantane and hexamethylenetetramine,
J. Am. Chem. Soc., 1970, 92, 25, 7296-7299, https://doi.org/10.1021/ja00728a011
. [all data]
Stephenson and Malanowski, 1987
Stephenson, Richard M.; Malanowski, Stanislaw,
Handbook of the Thermodynamics of Organic Compounds, 1987, https://doi.org/10.1007/978-94-009-3173-2
. [all data]
De Wit, Van Miltenburg, et al., 1983
De Wit, H.G.M.; Van Miltenburg, J.C.; De Kruif, C.G.,
Thermodynamic properties of molecular organic crystals containing nitrogen, oxygen, and sulphur 1. Vapour pressures and enthalpies of sublimation,
The Journal of Chemical Thermodynamics, 1983, 15, 7, 651-663, https://doi.org/10.1016/0021-9614(83)90079-4
. [all data]
Budurov, 1960
Budurov, S.,
Izv. Khim. Inst. Bulg. Akad. Nauk, 1960, 7, 281. [all data]
Dewar and Worley, 1969
Dewar, M.J.S.; Worley, S.D.,
Photoelectron spectra of molecules. I. Ionization potentials of some organic molecules and their interpretation,
J. Chem. Phys., 1969, 50, 654. [all data]
Cowley, Lattman, et al., 1982
Cowley, A.H.; Lattman, M.; Stricklen, P.M.; Verkade, J.G.,
UV photoelectron spectroscopic investigation of some polycyclic group 5A compounds and related acyclic species. 1. Free and coordinated aminophosphines and related compounds,
Inorg. Chem., 1982, 21, 543. [all data]
Nelsen and Buschek, 1974
Nelsen, S.F.; Buschek, J.M.,
Photoelectron spectra of some cyclic di- and polyamines. Lone pair-lone pair interaction in 1,3- and 1,4-diamines,
J. Am. Chem. Soc., 1974, 96, 7930. [all data]
Staples and Zeiger, 2008
Staples, E.; Zeiger, K.,
On-Site Measurements of VOCs and Odors from Metal Casting Operations Using an Ultra-Fast Gas Chromatograph, 2008, retrieved from http://www.estcal.com/TechPapers/Industrial/FoundryOdors.doc. [all data]
Ardrey and Moffat, 1981
Ardrey, R.E.; Moffat, A.C.,
Gas-liquid chromatographic retention indices of 1318 substances of toxicological interest on SE-30 or OV-1 stationary phase,
J. Chromatogr., 1981, 220, 3, 195-252, https://doi.org/10.1016/S0021-9673(00)81925-1
. [all data]
Waggott and Davies, 1984
Waggott, A.; Davies, I.W.,
Identification of organic pollutants using linear temperature programmed retention indices (LTPRIs) - Part II, 1984, retrieved from http://dwi.defra.gov.uk/research/completed-research/reports/dwi0383.pdf. [all data]
Chen, Keeran, et al., 2002
Chen, P.H.; Keeran, W.S.; Van Ausdale, W.A.; Schindler, D.R.; Roberts, D.W.,
Application of Lee retention indices to the confirmation of tentatively identified compounds from GC/MS analysis of environmental samples, Technical paper, Analytical Services Division, Environmental ScienceEngineering, Inc, PO Box 1703, Gainesville, FL 32602, 2002, 11. [all data]