1-Pentanone, 1-phenyl-
- Formula: C11H14O
- Molecular weight: 162.2283
- IUPAC Standard InChIKey: XKGLSKVNOSHTAD-UHFFFAOYSA-N
- CAS Registry Number: 1009-14-9
- Chemical structure:
View 3d structure (requires JavaScript / HTML 5) - Other names: Valerophenone; Butyl phenyl ketone; 1-Phenyl-1-pentanone; Pentanophenone

Phase change data

Data compiled by: Robert L. Brown and Stephen E. Stein
Reduced pressure boiling point
Tboil (K) | Pressure (bar) | Reference |
---|---|---|
379.2 | 0.007 | Aldrich Chemical Company Inc., 1990 |

Gas phase ion energetics data

Data compiled as indicated in comments:
LLK - Sharon G. Lias, Rhoda D. Levin, and Sherif A. Kafafi
LBLHLM - Sharon G. Lias, John E. Bartmess, Joel F. Liebman, John L. Holmes, Rhoda D. Levin, and W. Gary Mallard
Ionization energy determinations
IE (eV) | Method | Reference | Comment |
---|---|---|---|
9.3 | PE | Koenig, Wielesek, et al., 1977 | Vertical value; LLK |
Appearance energy determinations
Ion | AE (eV) | Other Products | Method | Reference | Comment |
---|---|---|---|---|---|
C8H8O+ | 9.31 ± 0.05 | CH3CH=CH2 | EI | Turecek, 1986 | LBLHLM |

Van Den Dool and Kratz RI, non-polar column, temperature ramp

Column type | Active phase | I | Reference | Comment |
---|---|---|---|---|
Capillary | Ultra-2 | 1373.2 | Akporhonor, le Vent, et al., 1990 | 25. m/0.2 mm/0.33 μm, N2, 15. K/min; Tstart: 60.01 C |
Capillary | Ultra-2 | 1355.6 | Akporhonor, le Vent, et al., 1990 | 25. m/0.2 mm/0.33 μm, N2, 2. K/min; Tstart: 60.01 C |
Capillary | Ultra-2 | 1365.7 | Akporhonor, le Vent, et al., 1990 | 25. m/0.2 mm/0.33 μm, N2, 7. K/min; Tstart: 60.01 C |
Capillary | Ultra-2 | 1378.7 | Akporhonor, le Vent, et al., 1990 | 25. m/0.2 mm/0.33 μm, N2, 15. K/min; Tstart: 120.01 C |
Capillary | Ultra-2 | 1366.2 | Akporhonor, le Vent, et al., 1990 | 25. m/0.2 mm/0.33 μm, N2, 2. K/min; Tstart: 120.01 C |
Capillary | Ultra-2 | 1372.6 | Akporhonor, le Vent, et al., 1990 | 25. m/0.2 mm/0.33 μm, N2, 7. K/min; Tstart: 120.01 C |

Van Den Dool and Kratz RI, non-polar column, custom temperature program

Column type | Active phase | I | Reference | Comment |
---|---|---|---|---|
Capillary | HP-5MS | 1359.5 | Andriamaharavo, 2014 | 30. m/0.25 mm/0.25 μm, He; Program: 60C (1 min) => 5 C/min => 210C => 10 C/min => 280C (15 min) |

Normal alkane RI, non-polar column, temperature ramp

Column type | Active phase | I | Reference | Comment |
---|---|---|---|---|
Capillary | HP-5 MS | 1372. | Ukolova and Zenkevich, 2011 | 25. m/0.20 mm/0.33 μm, Helium, 10. K/min; Tstart: 40. C; Tend: 280. C |
Capillary | HP-5 MS | 1374. | Ukolova and Zenkevich, 2011 | 25. m/0.20 mm/0.33 μm, Helium, 10. K/min; Tstart: 40. C; Tend: 280. C |
Capillary | HP-5 MS | 1374. | Ukolova and Zenkevich, 2011 | 25. m/0.20 mm/0.33 μm, Helium, 10. K/min; Tstart: 40. C; Tend: 280. C |
Capillary | HP-5 MS | 1374. | Ukolova and Zenkevich, 2011 | 25. m/0.20 mm/0.33 μm, Helium, 10. K/min; Tstart: 40. C; Tend: 280. C |
Capillary | HP-5 MS | 1374. | Ukolova and Zenkevich, 2011 | 25. m/0.20 mm/0.33 μm, Helium, 10. K/min; Tstart: 40. C; Tend: 280. C |
Capillary | HP-5 MS | 1375. | Ukolova and Zenkevich, 2011 | 25. m/0.20 mm/0.33 μm, Helium, 10. K/min; Tstart: 40. C; Tend: 280. C |
Capillary | HP-5 MS | 1375. | Ukolova and Zenkevich, 2011 | 25. m/0.20 mm/0.33 μm, Helium, 10. K/min; Tstart: 40. C; Tend: 280. C |
Capillary | HP-5 MS | 1375. | Ukolova and Zenkevich, 2011 | 25. m/0.20 mm/0.33 μm, Helium, 10. K/min; Tstart: 40. C; Tend: 280. C |
Capillary | HP-5 MS | 1376. | Ukolova and Zenkevich, 2011 | 25. m/0.20 mm/0.33 μm, Helium, 10. K/min; Tstart: 40. C; Tend: 280. C |
Capillary | HP-5 MS | 1376. | Ukolova and Zenkevich, 2011 | 25. m/0.20 mm/0.33 μm, Helium, 10. K/min; Tstart: 40. C; Tend: 280. C |
Capillary | HP-5 MS | 1378. | Ukolova and Zenkevich, 2011 | 25. m/0.20 mm/0.33 μm, Helium, 10. K/min; Tstart: 40. C; Tend: 280. C |
Capillary | HP-5 MS | 1380. | Ukolova and Zenkevich, 2011 | 25. m/0.20 mm/0.33 μm, Helium, 10. K/min; Tstart: 40. C; Tend: 280. C |
Capillary | HP-5MS | 1364. | Kim, Abd El-Aty, et al., 2006 | 30. m/0.25 mm/0.25 μm, He, 50. C @ 4. min, 5. K/min, 280. C @ 10. min |

Normal alkane RI, non-polar column, custom temperature program

Column type | Active phase | I | Reference | Comment |
---|---|---|---|---|
Capillary | Polydimethyl siloxanes | 1327. | Zenkevich and Chupalov, 1996 | Program: not specified |

References

Aldrich Chemical Company Inc., 1990
Aldrich Chemical Company Inc.,
Catalog Handbook of Fine Chemicals, Aldrich Chemical Company, Inc., Milwaukee WI, 1990, 1. [all data]
Koenig, Wielesek, et al., 1977
Koenig, T.; Wielesek, R.; Miller, L.L.; So, Y.-H.,
Correlation of electrochemical reactivity and photoelectron spectra of aromatic ketones,
J. Am. Chem. Soc., 1977, 99, 7061. [all data]
Turecek, 1986
Turecek, F.,
1-Phenylethenol: The enol form of acetophenone. Preparation, ionization energy, and the heat of formation in the gas phase,
Tetrahedron Lett., 1986, 27, 4219. [all data]
Akporhonor, le Vent, et al., 1990
Akporhonor, E.E.; le Vent, S.; Taylor, D.R.,
Calculation of programmed temperature gas chromatographic characteristics from isothermal data. III. Predicted retention indices and equivalent temperatures,
J. Chromatogr., 1990, 504, 269-278, https://doi.org/10.1016/S0021-9673(01)89532-7
. [all data]
Andriamaharavo, 2014
Andriamaharavo, N.R.,
Retention Data. NIST Mass Spectrometry Data Center., NIST Mass Spectrometry Data Center, 2014. [all data]
Ukolova and Zenkevich, 2011
Ukolova, E.S.; Zenkevich, I.G.,
Increasing the reproducibility of gas chromatographic retention indices determination using capillary columns,
Proc. St. Petersburg State University (ser. Phys-Chem), 2011, 2, 157-164. [all data]
Kim, Abd El-Aty, et al., 2006
Kim, M.R.; Abd El-Aty, A.M.; Kim, I.S.; Shim, J.H.,
Determination of volatile flavor components in danggui cultivars by solvent free injection and hydrodistillation followed by gas chromatographic-mass spectrometric analysis,
J. Chromatogr. A, 2006, 1116, 1-2, 259-264, https://doi.org/10.1016/j.chroma.2006.03.060
. [all data]
Zenkevich and Chupalov, 1996
Zenkevich, I.G.; Chupalov, A.A.,
New Possibilities of Chromato Mass Pectrometric Identification of Organic Compounds Using Increments of Gas Chromatographic Retention Indices of Molecular Structural Fragments,
Zh. Org. Khim. (Rus.), 1996, 32, 5, 656-666. [all data]