(CH3)3CCH2N(CH3)2
- Formula: C7H17N
- Molecular weight: 115.2166
- IUPAC Standard InChIKey: FUIRUFXAVIHAQB-UHFFFAOYSA-N
- CAS Registry Number: 10076-31-0
- Chemical structure:
View 3d structure (requires JavaScript / HTML 5) - Other names: N,N-Dimethyl neopentylamine; Dimethyl(neopentyl)amine

Gas phase ion energetics data

Data evaluated as indicated in comments:
HL - Edward P. Hunter and Sharon G. Lias
Data compiled as indicated in comments:
LL - Sharon G. Lias and Joel F. Liebman
Quantity | Value | Units | Method | Reference | Comment |
---|---|---|---|---|---|
Proton affinity (review) | 970.5 | kJ/mol | N/A | Hunter and Lias, 1998 | HL |
Quantity | Value | Units | Method | Reference | Comment |
Gas basicity | 939.5 | kJ/mol | N/A | Hunter and Lias, 1998 | HL |
Appearance energy determinations
Ion | AE (eV) | Other Products | Method | Reference | Comment |
---|---|---|---|---|---|
C3H8N+ | 8.59 | (CH3)3C | EI | Holmes, Lossing, et al., 1988 | LL |

References

Hunter and Lias, 1998
Hunter, E.P.; Lias, S.G.,
Evaluated Gas Phase Basicities and Proton Affinities of Molecules: An Update,
J. Phys. Chem. Ref. Data, 1998, 27, 3, 413-656, https://doi.org/10.1063/1.556018
. [all data]
Holmes, Lossing, et al., 1988
Holmes, J.L.; Lossing, F.P.; Maccoll, A.,
Heats of formation of alkyl radicals from appearance energies,
J. Am. Chem. Soc., 1988, 110, 7339. [all data]