Naphthalene,1-(methylthio)-
- Formula: C11H10S
- Molecular weight: 174.262
- IUPAC Standard InChIKey: DKICYCNWKRHPFR-UHFFFAOYSA-N
- CAS Registry Number: 10075-72-6
- Chemical structure:
View 3d structure (requires JavaScript / HTML 5) - Permanent link for this species. Use this link for bookmarking this species for future reference.

Gas phase ion energetics data

Data compiled by: Sharon G. Lias, Rhoda D. Levin, and Sherif A. Kafafi
Ionization energy determinations
IE (eV) | Method | Reference | Comment |
---|---|---|---|
7.67 | PE | Bock and Wagner, 1972 | Vertical value |

References

Bock and Wagner, 1972
Bock, H.; Wagner, G.,
Electron lone pairs in organic sulfides and disulfides,
Angew. Chem. Int. Ed. Engl., 1972, 11, 119. [all data]