1,5-Naphthalenediamine,N,N,N',N'-tetramethyl-
- Formula: C14H18N2
- Molecular weight: 214.3061
- IUPAC Standard InChIKey: TYMBOHQMUQAOBA-UHFFFAOYSA-N
- CAS Registry Number: 10075-69-1
- Chemical structure:
View 3d structure (requires JavaScript / HTML 5) - Permanent link for this species. Use this link for bookmarking this species for future reference.

Phase change data

Data compiled by: William E. Acree, Jr., James S. Chickos
Quantity | Value | Units | Method | Reference | Comment |
---|---|---|---|---|---|
ΔsubH° | 98.6 ± 0.4 | kJ/mol | GS | Verevkin, Georgieva, et al., 2007 | Based on data from 318. to 356. K. |

Gas phase ion energetics data

Data compiled as indicated in comments:
LLK - Sharon G. Lias, Rhoda D. Levin, and Sherif A. Kafafi
Ionization energy determinations
IE (eV) | Method | Reference | Comment |
---|---|---|---|
6.70 ± 0.02 | PE | Maier, 1974 | LLK |

References

Verevkin, Georgieva, et al., 2007
Verevkin, Sergey P.; Georgieva, Miglena; Melkhanova, Svetlana V.,
Vapor Pressures and Phase Transitions of a Series of the Aminonaphthalenes,
J. Chem. Eng. Data, 2007, 52, 1, 286-290, https://doi.org/10.1021/je060394v
. [all data]
Maier, 1974
Maier, J.P.,
Photoelectron spectroscopy of peri- amino naphthalenes,
Helv. Chim. Acta, 1974, 57, 994. [all data]