Stannane,trimethyl(phenylthio)-
- Formula: C9H14SSn
- Molecular weight: 272.982
- IUPAC Standard InChIKey: LXCDQLHCNMCPPH-UHFFFAOYSA-M
- CAS Registry Number: 1007-27-8
- Chemical structure:
View 3d structure (requires JavaScript / HTML 5) - Permanent link for this species. Use this link for bookmarking this species for future reference.

Gas phase ion energetics data

Data compiled by: Sharon G. Lias, Rhoda D. Levin, and Sherif A. Kafafi
Ionization energy determinations
IE (eV) | Method | Reference | Comment |
---|---|---|---|
7.9 ± 0.1 | EI | Distefano, Ricci, et al., 1974 | |
8.40 ± 0.05 | PE | Distefano, Pignataro, et al., 1974 | Vertical value |
Appearance energy determinations
Ion | AE (eV) | Other Products | Method | Reference | Comment |
---|---|---|---|---|---|
C3H9Sn+ | 9.4 ± 0.1 | ? | EI | Distefano, Ricci, et al., 1974 | |
C8H11SSn+ | 9.2 ± 0.1 | CH3 | EI | Distefano, Ricci, et al., 1974 |

References

Distefano, Ricci, et al., 1974
Distefano, G.; Ricci, A.; Danieli, R.; Foffani, A.; Innorta, G.; Torroni, S.,
Mass spectrometric evidence for p π-d π bonding between sulfur and the Group IVB elements,
J. Organomet. Chem., 1974, 65, 205. [all data]
Distefano, Pignataro, et al., 1974
Distefano, G.; Pignataro, S.; Ricci, A.; Colonna, F.P.; Pietropaolo, D.,
Interactions of π-orbitals with the group IV elements studied by ionization energy measurements,
Ann. Chim., 1974, 64, 153. [all data]