Cyclopropyl phenylmethanol
- Formula: C10H12O
- Molecular weight: 148.2017
- IUPAC Standard InChIKey: GOXKCYOMDINCCD-UHFFFAOYSA-N
- CAS Registry Number: 1007-03-0
- Chemical structure:
View 3d structure (requires JavaScript / HTML 5) - Other names: Cyclopropyl phenyl carbinol; Benzenemethanol, α-cyclopropyl-; alpha-cyclopropylbenzyl alcohol

Phase change data

Data compiled by: Robert L. Brown and Stephen E. Stein
Reduced pressure boiling point
Tboil (K) | Pressure (bar) | Reference |
---|---|---|
405.7 | 0.024 | Aldrich Chemical Company Inc., 1990 |

Gas phase ion energetics data

Data compiled as indicated in comments:
LLK - Sharon G. Lias, Rhoda D. Levin, and Sherif A. Kafafi
Ionization energy determinations
IE (eV) | Method | Reference | Comment |
---|---|---|---|
8.3 ± 0.1 | EI | Dallinga, Nibbering, et al., 1981 | LLK |
Appearance energy determinations
Ion | AE (eV) | Other Products | Method | Reference | Comment |
---|---|---|---|---|---|
C8H8O+ | 8.90 | ? | EI | Dallinga, Nibbering, et al., 1981 | LLK |

References

Aldrich Chemical Company Inc., 1990
Aldrich Chemical Company Inc.,
Catalog Handbook of Fine Chemicals, Aldrich Chemical Company, Inc., Milwaukee WI, 1990, 1. [all data]
Dallinga, Nibbering, et al., 1981
Dallinga, J.W.; Nibbering, N.M.M.; Louter, G.J.,
Formation and structure of [C8H8O]+ ions, generated from gas phase ions of phenylcyclopropylcarbinol and 1-phenyl-1-(hydroxymethyl)cyclopropane,
Org. Mass Spectrom., 1981, 16, 4. [all data]