Pyridine, 2-ethenyl-
- Formula: C7H7N
- Molecular weight: 105.1372
- IUPAC Standard InChIKey: KGIGUEBEKRSTEW-UHFFFAOYSA-N
- CAS Registry Number: 100-69-6
- Chemical structure:
View 3d structure (requires JavaScript / HTML 5) - Other names: Pyridine, 2-vinyl-; 2-Vinylpyridine; 2-Ethenylpyridine; α-Vinylpyridine

Condensed phase thermochemistry data

Data compiled by: Hussein Y. Afeefy, Joel F. Liebman, and Stephen E. Stein
Quantity | Value | Units | Method | Reference | Comment |
---|---|---|---|---|---|
ΔfH°liquid | 157.0 | kJ/mol | Ccb | Balandin, Klabunovsky, et al., 1960 | |
Quantity | Value | Units | Method | Reference | Comment |
ΔcH°liquid | -3912. | kJ/mol | Ccb | Balandin, Klabunovsky, et al., 1960 |

Phase change data

Data compiled by: Robert L. Brown and Stephen E. Stein
Reduced pressure boiling point
Tboil (K) | Pressure (bar) | Reference |
---|---|---|
353.7 | 0.039 | Aldrich Chemical Company Inc., 1990 |
325.7 | 0.005 | Weast and Grasselli, 1989 |

Gas phase ion energetics data

Data compiled by: Sharon G. Lias, Rhoda D. Levin, and Sherif A. Kafafi
Ionization energy determinations
IE (eV) | Method | Reference | Comment |
---|---|---|---|
8.6 | PE | Modelli and Distefano, 1981 | |
8.92 | PE | Modelli and Distefano, 1981 | Vertical value |

Van Den Dool and Kratz RI, non-polar column, temperature ramp

Column type | Active phase | I | Reference | Comment |
---|---|---|---|---|
Capillary | DB-5 | 932. | Dallüge, van Stee, et al., 2002 | 30. m/0.25 mm/1. μm, He, 2.5 K/min; Tstart: 50. C; Tend: 200. C |

Normal alkane RI, non-polar column, temperature ramp

Column type | Active phase | I | Reference | Comment |
---|---|---|---|---|
Capillary | OV-101 | 905. | Zenkevich, 2005 | 25. m/0.20 mm/0.10 μm, N2/He, 6. K/min; Tstart: 50. C; Tend: 250. C |

References

Balandin, Klabunovsky, et al., 1960
Balandin, A.A.; Klabunovsky, E.I.; Oberemok-Yakubova, A.P.; Brusov, I.I.,
Thermochemical determination of the heat of combustion of 2-ethyl- and 2-vinylpyrydines,
Izv. Akad. Nauk SSSR, Ser. Khim., 1960, 784-786. [all data]
Aldrich Chemical Company Inc., 1990
Aldrich Chemical Company Inc.,
Catalog Handbook of Fine Chemicals, Aldrich Chemical Company, Inc., Milwaukee WI, 1990, 1. [all data]
Weast and Grasselli, 1989
CRC Handbook of Data on Organic Compounds, 2nd Editon, Weast,R.C and Grasselli, J.G., ed(s)., CRC Press, Inc., Boca Raton, FL, 1989, 1. [all data]
Modelli and Distefano, 1981
Modelli, A.; Distefano, G.,
He(I) photoelectron spectra of chloro-, vinyl- and acetyl-pyridines,
J. Electron Spectrosc. Relat. Phenom., 1981, 23, 323. [all data]
Fihtengolts, et al., 1969
Fihtengolts, V.S., et al.,
Atlas of UV Absorption Spectra of Substances Used in Synthetic Rubber Manufacture, 1969, 15. [all data]
Dallüge, van Stee, et al., 2002
Dallüge, J.; van Stee, L.L.P.; Xu, X.; Williams, J.; Beens, J.; Vreuls, R.J.J.; Brinkman, U.A.Th.,
Unravelling the composition of very complex samples by comprehensive gas chromatography coupled to time-of-flight mass spectrometry. Cigarette smoke,
J. Chromatogr. A, 2002, 974, 1-2, 169-184, https://doi.org/10.1016/S0021-9673(02)01384-5
. [all data]
Zenkevich, 2005
Zenkevich, I.G.,
Experimentally measured retention indices., 2005. [all data]