Benzene, (methylthio)-
- Formula: C7H8S
- Molecular weight: 124.203
- IUPAC Standard InChIKey: HNKJADCVZUBCPG-UHFFFAOYSA-N
- CAS Registry Number: 100-68-5
- Chemical structure:
View 3d structure (requires JavaScript / HTML 5) - Other names: Sulfide, methyl phenyl; (Methylthio)benzene; Anisole, thio-; Methyl phenyl sulfide; Phenyl methyl sulfide; Thioanisol; Thioanisole; 1-Phenyl-1-thiaethane; Methyl phenyl sulphide; (1-Thiaethyl)benzene; Phenylthiomethane; NSC 57916

Gas phase thermochemistry data

Data compiled by: Hussein Y. Afeefy, Joel F. Liebman, and Stephen E. Stein
Quantity | Value | Units | Method | Reference | Comment |
---|---|---|---|---|---|
ΔfH°gas | 97.28 ± 0.84 | kJ/mol | Ccr | Good, 1972 | Reanalyzed by Pedley, Naylor, et al., 1986, Original value = 97.61 ± 0.75 kJ/mol |
ΔfH°gas | 98. ± 3. | kJ/mol | Ccr | Mackle and Mayrick, 1962 |

Condensed phase thermochemistry data

Data compiled as indicated in comments:
ALS - Hussein Y. Afeefy, Joel F. Liebman, and Stephen E. Stein
DH - Eugene S. Domalski and Elizabeth D. Hearing
Quantity | Value | Units | Method | Reference | Comment |
---|---|---|---|---|---|
ΔfH°liquid | 43.30 ± 0.71 | kJ/mol | Ccr | Good, 1972 | ALS |
ΔfH°liquid | 48.0 ± 2.0 | kJ/mol | Ccr | Mackle and Mayrick, 1962 | ALS |
Quantity | Value | Units | Method | Reference | Comment |
ΔcH°liquid | -4543.2 ± 3.6 | kJ/mol | Ccr | Good, 1972 | Reanalyzed by Pedley, Naylor, et al., 1986, Original value = -4542.69 ± 0.59 kJ/mol; ALS |
ΔcH°liquid | -4547.8 ± 2.0 | kJ/mol | Ccr | Mackle and Mayrick, 1962 | ALS |
Quantity | Value | Units | Method | Reference | Comment |
S°liquid | 252.50 | J/mol*K | N/A | Messerly, Finke, et al., 1974 | DH |
Constant pressure heat capacity of liquid
Cp,liquid (J/mol*K) | Temperature (K) | Reference | Comment |
---|---|---|---|
206.02 | 298.15 | Messerly, Finke, et al., 1974 | T = 10 to 330 K.; DH |

Phase change data

Data compiled as indicated in comments:
BS - Robert L. Brown and Stephen E. Stein
TRC - Thermodynamics Research Center, NIST Boulder Laboratories, Chris Muzny director
ALS - Hussein Y. Afeefy, Joel F. Liebman, and Stephen E. Stein
DRB - Donald R. Burgess, Jr.
AC - William E. Acree, Jr., James S. Chickos
DH - Eugene S. Domalski and Elizabeth D. Hearing
Quantity | Value | Units | Method | Reference | Comment |
---|---|---|---|---|---|
Tboil | 461.2 | K | N/A | Aldrich Chemical Company Inc., 1990 | BS |
Tboil | 459. | K | N/A | Pochinok and Limarenko, 1955 | Uncertainty assigned by TRC = 4. K; TRC |
Tboil | 467. | K | N/A | Sabatier and Mailhe, 1910 | Uncertainty assigned by TRC = 3. K; TRC |
Quantity | Value | Units | Method | Reference | Comment |
Ttriple | 256.44 | K | N/A | Messerly, Finke, et al., 1974, 2 | Uncertainty assigned by TRC = 0.01 K; TRC |
Quantity | Value | Units | Method | Reference | Comment |
ΔvapH° | 52. ± 4. | kJ/mol | AVG | N/A | Average of 6 values; Individual data points |
Enthalpy of vaporization
ΔvapH (kJ/mol) | Temperature (K) | Method | Reference | Comment |
---|---|---|---|---|
47.5 | 404. | A,EB | Stephenson and Malanowski, 1987 | Based on data from 389. to 475. K. See also Osborn and Douslin, 1966 and Dykyj, Svoboda, et al., 1999.; AC |
Antoine Equation Parameters
log10(P) = A − (B / (T + C))
P = vapor pressure (bar)
T = temperature (K)
View plot Requires a JavaScript / HTML 5 canvas capable browser.
Temperature (K) | A | B | C | Reference |
---|---|---|---|---|
390.30 to 474.77 | 4.13639 | 1603.887 | -79.166 | Osborn and Douslin, 1966 |
Enthalpy of fusion
ΔfusH (kJ/mol) | Temperature (K) | Reference | Comment |
---|---|---|---|
14.8358 | 256.44 | Messerly, Finke, et al., 1974 | DH |
14.85 | 256.4 | Messerly, Finke, et al., 1974 | AC |
Entropy of fusion
ΔfusS (J/mol*K) | Temperature (K) | Reference | Comment |
---|---|---|---|
57.85 | 256.44 | Messerly, Finke, et al., 1974 | DH |

Reaction thermochemistry data

Data compiled by: John E. Bartmess
Individual Reactions
C7H7S- + =
By formula: C7H7S- + H+ = C7H8S
Quantity | Value | Units | Method | Reference | Comment |
---|---|---|---|---|---|
ΔrH° | 1616. ± 21. | kJ/mol | G+TS | Ingemann and Nibbering, 1985 | gas phase; value altered from reference due to change in acidity scale |
Quantity | Value | Units | Method | Reference | Comment |
ΔrG° | 1586. ± 21. | kJ/mol | IMRB | Ingemann and Nibbering, 1985 | gas phase; value altered from reference due to change in acidity scale |
C7H7S- + =
By formula: C7H7S- + H+ = C7H8S
Quantity | Value | Units | Method | Reference | Comment |
---|---|---|---|---|---|
ΔrH° | 1596. ± 8.8 | kJ/mol | G+TS | Ingemann and Nibbering, 1985 | gas phase; value altered from reference due to change in acidity scale |
Quantity | Value | Units | Method | Reference | Comment |
ΔrG° | 1566. ± 8.4 | kJ/mol | IMRE | Ingemann and Nibbering, 1985 | gas phase; value altered from reference due to change in acidity scale |

Henry's Law data

Data compiled by: Rolf Sander
Henry's Law constant (water solution)
kH(T) = k°H exp(d(ln(kH))/d(1/T) ((1/T) - 1/(298.15 K)))
k°H = Henry's law constant for solubility in water at 298.15 K (mol/(kg*bar))
d(ln(kH))/d(1/T) = Temperature dependence constant (K)
k°H (mol/(kg*bar)) | d(ln(kH))/d(1/T) (K) | Method | Reference |
---|---|---|---|
4.1 | V | N/A | |
4.1 | V | N/A |

Gas phase ion energetics data

Data evaluated as indicated in comments:
HL - Edward P. Hunter and Sharon G. Lias
L - Sharon G. Lias
Data compiled as indicated in comments:
B - John E. Bartmess
LLK - Sharon G. Lias, Rhoda D. Levin, and Sherif A. Kafafi
RDSH - Henry M. Rosenstock, Keith Draxl, Bruce W. Steiner, and John T. Herron
Quantity | Value | Units | Method | Reference | Comment |
---|---|---|---|---|---|
IE (evaluated) | 7.94 ± 0.02 | eV | N/A | N/A | L |
Quantity | Value | Units | Method | Reference | Comment |
Proton affinity (review) | 872.6 | kJ/mol | N/A | Hunter and Lias, 1998 | HL |
Quantity | Value | Units | Method | Reference | Comment |
Gas basicity | 843.7 | kJ/mol | N/A | Hunter and Lias, 1998 | HL |
Ionization energy determinations
IE (eV) | Method | Reference | Comment |
---|---|---|---|
7.93 | PE | Behan, Johnstone, et al., 1976 | LLK |
7.96 ± 0.01 | PI | Trofimov, Mel'der, et al., 1975 | LLK |
8.08 | CTS | Aloisi, Santini, et al., 1974 | LLK |
7.92 ± 0.02 | PI | Potapov, Kardash, et al., 1972 | LLK |
7.9 ± 0.15 | CTS | Voigt and Reid, 1964 | RDSH |
8.9 | EI | Gowenlock, Kay, et al., 1963 | RDSH |
8.07 | PE | Traven', Redchenko, et al., 1981 | Vertical value; LLK |
8.04 | PE | Kobayashi, 1978 | Vertical value; LLK |
8.02 | PE | Schweig and Thon, 1976 | Vertical value; LLK |
8.60 | PE | Dewar, Ernstbrunner, et al., 1974 | Vertical value; LLK |
8.07 | PE | Dewar, Ernstbrunner, et al., 1974 | Vertical value; LLK |
8.07 | PE | Bock and Wagner, 1972 | Vertical value; LLK |
Appearance energy determinations
Ion | AE (eV) | Other Products | Method | Reference | Comment |
---|---|---|---|---|---|
CHS+ | 14.5 | ? | EI | Gowenlock, Kay, et al., 1963 | RDSH |
C6H+ | 14.4 | ? | EI | Gowenlock, Kay, et al., 1963 | RDSH |
C6H5S+ | 12.1 ± 0.1 | ? | EI | Palmer and Lossing, 1962 | RDSH |
C6H6+ | 12.0 | ? | EI | Gowenlock, Kay, et al., 1963 | RDSH |
De-protonation reactions
C7H7S- + =
By formula: C7H7S- + H+ = C7H8S
Quantity | Value | Units | Method | Reference | Comment |
---|---|---|---|---|---|
ΔrH° | 1616. ± 21. | kJ/mol | G+TS | Ingemann and Nibbering, 1985 | gas phase; value altered from reference due to change in acidity scale; B |
Quantity | Value | Units | Method | Reference | Comment |
ΔrG° | 1586. ± 21. | kJ/mol | IMRB | Ingemann and Nibbering, 1985 | gas phase; value altered from reference due to change in acidity scale; B |
C7H7S- + =
By formula: C7H7S- + H+ = C7H8S
Quantity | Value | Units | Method | Reference | Comment |
---|---|---|---|---|---|
ΔrH° | 1596. ± 8.8 | kJ/mol | G+TS | Ingemann and Nibbering, 1985 | gas phase; value altered from reference due to change in acidity scale; B |
Quantity | Value | Units | Method | Reference | Comment |
ΔrG° | 1566. ± 8.4 | kJ/mol | IMRE | Ingemann and Nibbering, 1985 | gas phase; value altered from reference due to change in acidity scale; B |

Kovats' RI, non-polar column, isothermal

Data compiled by: NIST Mass Spectrometry Data Center, William E. Wallace, director

Column type PackedPackedPacked
Active phase Apiezon MApiezon MOV-101
Column length (m) 2.12.12.
Carrier gas He or N2
Substrate Chromosorb W, AW-DMCSChromosorb W, AW/DMSGas Chrom Q
Column diameter (mm)
Phase thickness (μm)
Temperature (C) 130.130.100.
I 1106.1106.1061.
ReferenceGarbuzov, Misharina, et al., 1985Golovnya, Garbuzov, et al., 1978West and Hall, 1975
Comment MSDC-RI MSDC-RI MSDC-RI

Normal alkane RI, non-polar column, custom temperature program

Data compiled by: NIST Mass Spectrometry Data Center, William E. Wallace, director

Column type Capillary
Active phase OV-1, SE-30, Methyl silicone, SP-2100, OV-101, DB-1, etc.
Column length (m) 50.
Carrier gas Hydrogen
Substrate
Column diameter (mm) 0.32
Phase thickness (μm)
Program not specified
I 1068.
ReferenceWaggott and Davies, 1984
Comment MSDC-RI

References

Good, 1972
Good, W.D.,
Enthalpies of combustion of 18 organic sulfur compounds related to petroleum,
J. Chem. Eng. Data, 1972, 17, 158-162. [all data]
Pedley, Naylor, et al., 1986
Pedley, J.B.; Naylor, R.D.; Kirby, S.P.,
Thermochemical Data of Organic Compounds, Chapman and Hall, New York, 1986, 1-792. [all data]
Mackle and Mayrick, 1962
Mackle, H.; Mayrick, R.G.,
Studies in the thermochemistry of organic sulphides. Part 1.-The gas-phase heats of formation of phenyl methyl, phenyl ethyl, benzyl methyl, and benzyl ethyl sulphides,
Trans. Faraday Soc., 1962, 58, 33-39. [all data]
Messerly, Finke, et al., 1974
Messerly, J.F.; Finke, H.L.; Todd, S.S.,
Low-temperature thermal studies on six organo-sulfur compounds,
J. Chem. Thermodynam., 1974, 6, 635-657. [all data]
Aldrich Chemical Company Inc., 1990
Aldrich Chemical Company Inc.,
Catalog Handbook of Fine Chemicals, Aldrich Chemical Company, Inc., Milwaukee WI, 1990, 1. [all data]
Pochinok and Limarenko, 1955
Pochinok, Ya.; Limarenko, A.P.,
Alkylation of Mercaptans with Alkylaryltriazines,
Ukrain. Khim. Zh., 1955, 21, 628-30. [all data]
Sabatier and Mailhe, 1910
Sabatier, P.; Mailhe, A.,
General Methods for Direct Preparation of Thiols by Catalysic Splitting of Alcohols,
C. R. Hebd. Seances Acad. Sci., 1910, 150, 1217. [all data]
Messerly, Finke, et al., 1974, 2
Messerly, J.F.; Finke, H.L.; Todd, S.S.,
Low-temperature thermal sudies on six organo-sulfur compounds,
J. Chem. Thermodyn., 1974, 6, 635-57. [all data]
Stephenson and Malanowski, 1987
Stephenson, Richard M.; Malanowski, Stanislaw,
Handbook of the Thermodynamics of Organic Compounds, 1987, https://doi.org/10.1007/978-94-009-3173-2
. [all data]
Osborn and Douslin, 1966
Osborn, A.G.; Douslin, D.R.,
Vapor Pressure Relations of 36 Sulfur Compounds Present in Petroleum.,
J. Chem. Eng. Data, 1966, 11, 4, 502-509, https://doi.org/10.1021/je60031a014
. [all data]
Dykyj, Svoboda, et al., 1999
Dykyj, J.; Svoboda, J.; Wilhoit, R.C.; Frenkel, M.L.; Hall, K.R.,
Vapor Pressure of Chemicals: Part A. Vapor Pressure and Antoine Constants for Hydrocarbons and Sulfur, Selenium, Tellurium and Hydrogen Containing Organic Compounds, Springer, Berlin, 1999, 373. [all data]
Ingemann and Nibbering, 1985
Ingemann, S.; Nibbering, N.M.M.,
Gas phase chemistry of alpha-thio carbanions,
Can. J. Chem., 1985, 62, 2273. [all data]
Hunter and Lias, 1998
Hunter, E.P.; Lias, S.G.,
Evaluated Gas Phase Basicities and Proton Affinities of Molecules: An Update,
J. Phys. Chem. Ref. Data, 1998, 27, 3, 413-656, https://doi.org/10.1063/1.556018
. [all data]
Behan, Johnstone, et al., 1976
Behan, J.M.; Johnstone, R.A.W.; Bentley, T.W.,
An evaluation of empirical methods for calculating the ionization potentials of substituted benzenes,
Org. Mass Spectrom., 1976, 11, 207. [all data]
Trofimov, Mel'der, et al., 1975
Trofimov, B.A.; Mel'der, U.K.; Pikver, R.I.; Vyalykh, E.P.,
Ionization potentials of unsaturated and sulfides the participation of neighboring multiple bonds of heteroatoms in the stabilization of the radical cation,
Teor. Eksp. Khim., 1975, 11, 129. [all data]
Aloisi, Santini, et al., 1974
Aloisi, G.G.; Santini, S.; Sorriso, S.,
Molecular complexes of substituted diphenyl sulphides with π acceptors. Charge transfer spectra and ionization potentials of the donors,
J. Chem. Soc. Faraday Trans. 1, 1974, 70, 1908. [all data]
Potapov, Kardash, et al., 1972
Potapov, V.K.; Kardash, I.E.; Sorokin, V.V.; Sokolov, S.A.; Evlasheva, T.I.,
Photoionization of heteroaromatic compounds,
Khim. Vys. Energ., 1972, 6, 392. [all data]
Voigt and Reid, 1964
Voigt, E.M.; Reid, C.,
Ionization potentials of substituted benzenes and their charge-transfer spectra with tetracyanoethylene,
J. Am. Chem. Soc., 1964, 86, 3930. [all data]
Gowenlock, Kay, et al., 1963
Gowenlock, B.G.; Kay, J.; Majer, J.R.,
Electron impact studies of some sulphides and disulphides,
J. Chem. Soc. Faraday Trans., 1963, 59, 2463. [all data]
Traven', Redchenko, et al., 1981
Traven', V.F.; Redchenko, V.V.; Eismont, M.Y.; Stepanov, B.I.,
Photoelectron spectra and electronic and steric structures of silicon and sulfur-containing analogs of 9,10-dihydroanthracene,
J. Gen. Chem. USSR, 1981, 51, 1099, In original 1297. [all data]
Kobayashi, 1978
Kobayashi, T.,
A simple general tendency in photoelectron angular distributions of some monosubstituted benzenes,
Phys. Lett., 1978, 69, 105. [all data]
Schweig and Thon, 1976
Schweig, A.; Thon, N.,
Measurement of relative conformational stabilities by variable temperature photoelectron spectroscopy. A study of rotational isomerism in thioanisole,
Chem. Phys. Lett., 1976, 38, 482. [all data]
Dewar, Ernstbrunner, et al., 1974
Dewar, P.S.; Ernstbrunner, E.; Gilmore, J.R.; Godfrey, M.; Mellor, J.M.,
Conformational analysis of alkyl aryl ethers and alkyl aryl sulphides by photoelectron spectroscopy,
Tetrahedron, 1974, 30, 2455. [all data]
Bock and Wagner, 1972
Bock, H.; Wagner, G.,
Electron lone pairs in organic sulfides and disulfides,
Angew. Chem. Int. Ed. Engl., 1972, 11, 119. [all data]
Palmer and Lossing, 1962
Palmer, T.F.; Lossing, F.P.,
Free radicals by mass spectrometry. XXVIII. The HS, CH3S, and phenyl-S radicals: ionization potentials and heats of formation,
J. Am. Chem. Soc., 1962, 84, 4661. [all data]