Anisole
- Formula: C7H8O
- Molecular weight: 108.1378
- IUPAC Standard InChIKey: RDOXTESZEPMUJZ-UHFFFAOYSA-N
- CAS Registry Number: 100-66-3
- Chemical structure:
View 3d structure (requires JavaScript / HTML 5) - Other names: Benzene, methoxy-; Anizol; Methoxybenzene; Methyl phenyl ether; Phenyl methyl ether; Ether, methyl phenyl-; UN 2222; Phenoxymethane; Anisol; NSC 7920

Reaction thermochemistry data

Data compiled as indicated in comments:
B - John E. Bartmess
M - Michael M. Meot-Ner (Mautner) and Sharon G. Lias
ALS - Hussein Y. Afeefy, Joel F. Liebman, and Stephen E. Stein
RCD - Robert C. Dunbar
Individual Reactions
By formula: Br- + C7H8O = (Br- • C7H8O)
Quantity | Value | Units | Method | Reference | Comment |
---|---|---|---|---|---|
ΔrH° | 49.4 ± 7.5 | kJ/mol | IMRE | Paul and Kebarle, 1991 | gas phase; ΔGaff measured at 303 K, corrected to 423 K, ΔSaff taken as that of PhNO2..Br-; B,M |
Quantity | Value | Units | Method | Reference | Comment |
ΔrS° | 84. | J/mol*K | N/A | Paul and Kebarle, 1991 | gas phase; Entropy change calculated or estimated; M |
Quantity | Value | Units | Method | Reference | Comment |
ΔrG° | 14. ± 4.2 | kJ/mol | IMRE | Paul and Kebarle, 1991 | gas phase; ΔGaff measured at 303 K, corrected to 423 K, ΔSaff taken as that of PhNO2..Br-; B |
Free energy of reaction
ΔrG° (kJ/mol) | T (K) | Method | Reference | Comment |
---|---|---|---|---|
14. | 423. | PHPMS | Paul and Kebarle, 1991 | gas phase; Entropy change calculated or estimated; M |
C7H7O- + =
By formula: C7H7O- + H+ = C7H8O
Quantity | Value | Units | Method | Reference | Comment |
---|---|---|---|---|---|
ΔrH° | 1679. ± 13. | kJ/mol | G+TS | Dahlke and Kass, 1992 | gas phase; Acid: anisole. Between o-methoxyphenide and Me2NH.; B |
Quantity | Value | Units | Method | Reference | Comment |
ΔrG° | 1648. ± 13. | kJ/mol | IMRB | Dahlke and Kass, 1992 | gas phase; Acid: anisole. Between o-methoxyphenide and Me2NH.; B |
C7H7O- + =
By formula: C7H7O- + H+ = C7H8O
Quantity | Value | Units | Method | Reference | Comment |
---|---|---|---|---|---|
ΔrH° | 1666. ± 13. | kJ/mol | G+TS | Dahlke and Kass, 1992 | gas phase; Acid: anisole. Between HO- and m,p-methoxyphenide; B |
Quantity | Value | Units | Method | Reference | Comment |
ΔrG° | 1636. ± 13. | kJ/mol | IMRB | Dahlke and Kass, 1992 | gas phase; Acid: anisole. Between HO- and m,p-methoxyphenide; B |
C7H7O- + =
By formula: C7H7O- + H+ = C7H8O
Quantity | Value | Units | Method | Reference | Comment |
---|---|---|---|---|---|
ΔrH° | 1681. ± 13. | kJ/mol | G+TS | Dahlke and Kass, 1992 | gas phase; Acid: anisole. Between o-OMe-phenide and Me2NH.; B |
Quantity | Value | Units | Method | Reference | Comment |
ΔrG° | 1648. ± 13. | kJ/mol | IMRB | Dahlke and Kass, 1992 | gas phase; Acid: anisole. Between o-OMe-phenide and Me2NH.; B |
By formula: Cl- + C7H8O = (Cl- • C7H8O)
Quantity | Value | Units | Method | Reference | Comment |
---|---|---|---|---|---|
ΔrG° | 30.5 | kJ/mol | TDEq | French, Ikuta, et al., 1982 | gas phase; B |
Free energy of reaction
ΔrG° (kJ/mol) | T (K) | Method | Reference | Comment |
---|---|---|---|---|
31. | 300. | PHPMS | French, Ikuta, et al., 1982 | gas phase; M |
By formula: HI + C7H7IO = C7H8O + I2
Quantity | Value | Units | Method | Reference | Comment |
---|---|---|---|---|---|
ΔrH° | -29. ± 5.0 | kJ/mol | Cm | Brennan and Ubbelohde, 1956 | gas phase; ALS |
By formula: (Li+ • C7H8O) + C7H8O = (Li+ • 2C7H8O)
Quantity | Value | Units | Method | Reference | Comment |
---|---|---|---|---|---|
ΔrH° | 121. ± 4. | kJ/mol | CIDT | Amunugama and Rodgers, 2003 | RCD |
By formula: (Na+ • C7H8O) + C7H8O = (Na+ • 2C7H8O)
Quantity | Value | Units | Method | Reference | Comment |
---|---|---|---|---|---|
ΔrH° | 90. ± 3. | kJ/mol | CIDT | Amunugama and Rodgers, 2003 | RCD |
By formula: (Cs+ • C7H8O) + C7H8O = (Cs+ • 2C7H8O)
Quantity | Value | Units | Method | Reference | Comment |
---|---|---|---|---|---|
ΔrH° | 62. ± 4. | kJ/mol | CIDT | Amunugama and Rodgers, 2003 | RCD |
By formula: (Rb+ • C7H8O) + C7H8O = (Rb+ • 2C7H8O)
Quantity | Value | Units | Method | Reference | Comment |
---|---|---|---|---|---|
ΔrH° | 64. ± 3. | kJ/mol | CIDT | Amunugama and Rodgers, 2003 | RCD |
By formula: (K+ • C7H8O) + C7H8O = (K+ • 2C7H8O)
Quantity | Value | Units | Method | Reference | Comment |
---|---|---|---|---|---|
ΔrH° | 70. ± 3. | kJ/mol | CIDT | Amunugama and Rodgers, 2003 | RCD |
By formula: Li+ + C7H8O = (Li+ • C7H8O)
Quantity | Value | Units | Method | Reference | Comment |
---|---|---|---|---|---|
ΔrH° | 185. ± 19. | kJ/mol | CIDT | Amunugama and Rodgers, 2003 | RCD |
By formula: Na+ + C7H8O = (Na+ • C7H8O)
Quantity | Value | Units | Method | Reference | Comment |
---|---|---|---|---|---|
ΔrH° | 113. ± 8.4 | kJ/mol | CIDT | Amunugama and Rodgers, 2003 | RCD |
By formula: Cs+ + C7H8O = (Cs+ • C7H8O)
Quantity | Value | Units | Method | Reference | Comment |
---|---|---|---|---|---|
ΔrH° | 66.5 ± 5.0 | kJ/mol | CIDT | Amunugama and Rodgers, 2003 | RCD |
By formula: Rb+ + C7H8O = (Rb+ • C7H8O)
Quantity | Value | Units | Method | Reference | Comment |
---|---|---|---|---|---|
ΔrH° | 72.4 ± 4.2 | kJ/mol | CIDT | Amunugama and Rodgers, 2003 | RCD |
By formula: K+ + C7H8O = (K+ • C7H8O)
Quantity | Value | Units | Method | Reference | Comment |
---|---|---|---|---|---|
ΔrH° | 79. ± 3. | kJ/mol | CIDT | Amunugama and Rodgers, 2003 | RCD |

Henry's Law data

Data compiled by: Rolf Sander
Henry's Law constant (water solution)
kH(T) = k°H exp(d(ln(kH))/d(1/T) ((1/T) - 1/(298.15 K)))
k°H = Henry's law constant for solubility in water at 298.15 K (mol/(kg*bar))
d(ln(kH))/d(1/T) = Temperature dependence constant (K)
k°H (mol/(kg*bar)) | d(ln(kH))/d(1/T) (K) | Method | Reference |
---|---|---|---|
0.24 | V | N/A | |
0.24 | R | N/A |

Gas phase ion energetics data

Data evaluated as indicated in comments:
HL - Edward P. Hunter and Sharon G. Lias
L - Sharon G. Lias
Data compiled as indicated in comments:
B - John E. Bartmess
LBLHLM - Sharon G. Lias, John E. Bartmess, Joel F. Liebman, John L. Holmes, Rhoda D. Levin, and W. Gary Mallard
LLK - Sharon G. Lias, Rhoda D. Levin, and Sherif A. Kafafi
RDSH - Henry M. Rosenstock, Keith Draxl, Bruce W. Steiner, and John T. Herron
Quantity | Value | Units | Method | Reference | Comment |
---|---|---|---|---|---|
IE (evaluated) | 8.20 ± 0.05 | eV | N/A | N/A | L |
Quantity | Value | Units | Method | Reference | Comment |
Proton affinity (review) | 839.6 | kJ/mol | N/A | Hunter and Lias, 1998 | HL |
Quantity | Value | Units | Method | Reference | Comment |
Gas basicity | 807.2 | kJ/mol | N/A | Hunter and Lias, 1998 | HL |
Ionization energy determinations
IE (eV) | Method | Reference | Comment |
---|---|---|---|
8.25 ± 0.03 | PI | Ponomarev, Arapov, et al., 1986 | LBLHLM |
~8.10 | PE | Klasinc, Kovac, et al., 1983 | LBLHLM |
8.24 | PE | Behan, Johnstone, et al., 1976 | LLK |
8.6 | EI | McLafferty, Bente, et al., 1973 | LLK |
8.20 ± 0.02 | PE | Maier and Turner, 1973 | LLK |
8.37 | CTS | Kobayashi, Kobayashi, et al., 1973 | LLK |
8.3 ± 0.1 | EI | Gilbert, Leach, et al., 1973 | LLK |
8.20 | EI | Cooks, Bertrand, et al., 1973 | LLK |
8.18 | CTS | Pitt, Carey, et al., 1972 | LLK |
8.8 ± 0.1 | EI | Gross, 1972 | LLK |
8.4 ± 0.1 | EI | Brown, 1970 | RDSH |
8.21 | PE | Dewar and Worley, 1969 | RDSH |
8.6 | EI | Williams, Cooks, et al., 1968 | RDSH |
8.22 ± 0.02 | PI | Watanabe, Nakayama, et al., 1962 | RDSH |
8.20 ± 0.02 | PI | Watanabe, 1957 | RDSH |
8.39 | PE | Klasinc, Kovac, et al., 1983 | Vertical value; LBLHLM |
8.45 | PE | Friege and Klessinger, 1979 | Vertical value; LLK |
8.42 | PE | Kobayashi, 1978 | Vertical value; LLK |
8.25 | PE | Benoit and Harrison, 1977 | Vertical value; LLK |
8.39 | PE | Kobayashi and Nagakura, 1974 | Vertical value; LLK |
8.46 | PE | Dewar, Ernstbrunner, et al., 1974 | Vertical value; LLK |
8.42 | PE | Bock and Wagner, 1972 | Vertical value; LLK |
Appearance energy determinations
Ion | AE (eV) | Other Products | Method | Reference | Comment |
---|---|---|---|---|---|
C5H5+ | 13.1 ± 0.1 | CH3+CO | PIPECO | Das, Gilman, et al., 1986 | LBLHLM |
C5H5+ | 13.5 | ? | EI | Harrison, Haynes, et al., 1965 | RDSH |
C6H5O+ | 11.70 ± 0.05 | CH3 | PI | Ponomarev, Arapov, et al., 1986 | LBLHLM |
C6H5O+ | 11.9 ± 0.1 | CH3 | PIPECO | Das, Gilman, et al., 1986 | LBLHLM |
C6H5O+ | 11.3 | CH3 | EI | McLafferty, Bente, et al., 1973 | LLK |
C6H5O+ | 11.8 ± 0.1 | CH3 | EI | Brown, 1970 | RDSH |
C6H5O+ | 11.9 ± 0.1 | CH3 | EI | Fisher, Palmer, et al., 1964 | RDSH |
C6H5O+ | 11.9 ± 0.1 | CH3 | EI | Tait, Shannon, et al., 1962 | RDSH |
C6H6+ | 10.85 ± 0.05 | CH2O | PI | Ziesel and Lifshitz, 1987 | LBLHLM |
C6H6+ | 11.4 ± 0.1 | CH2O | PIPECO | Das, Gilman, et al., 1986 | LBLHLM |
C6H6+ | 11.50 | HCHO | EI | Cooks, Bertrand, et al., 1973 | LLK |
C6H6+ | 11.6 ± 0.1 | HCHO | EI | Gross, 1972 | LLK |
C6H6+ | 11.3 ± 0.1 | CH2O | EI | Brown, 1970 | RDSH |
C6H6+ | 11.30 | ? | EI | Howe and Williams, 1969 | RDSH |
C6H7+ | 12.1 ± 0.1 | CHO | PIPECO | Das, Gilman, et al., 1986 | LBLHLM |
C6H7+ | 12.1 | CO+H? | EI | Harrison, Haynes, et al., 1965 | RDSH |
De-protonation reactions
C7H7O- + =
By formula: C7H7O- + H+ = C7H8O
Quantity | Value | Units | Method | Reference | Comment |
---|---|---|---|---|---|
ΔrH° | 1679. ± 13. | kJ/mol | G+TS | Dahlke and Kass, 1992 | gas phase; Acid: anisole. Between o-methoxyphenide and Me2NH.; B |
Quantity | Value | Units | Method | Reference | Comment |
ΔrG° | 1648. ± 13. | kJ/mol | IMRB | Dahlke and Kass, 1992 | gas phase; Acid: anisole. Between o-methoxyphenide and Me2NH.; B |
C7H7O- + =
By formula: C7H7O- + H+ = C7H8O
Quantity | Value | Units | Method | Reference | Comment |
---|---|---|---|---|---|
ΔrH° | 1666. ± 13. | kJ/mol | G+TS | Dahlke and Kass, 1992 | gas phase; Acid: anisole. Between HO- and m,p-methoxyphenide; B |
Quantity | Value | Units | Method | Reference | Comment |
ΔrG° | 1636. ± 13. | kJ/mol | IMRB | Dahlke and Kass, 1992 | gas phase; Acid: anisole. Between HO- and m,p-methoxyphenide; B |
C7H7O- + =
By formula: C7H7O- + H+ = C7H8O
Quantity | Value | Units | Method | Reference | Comment |
---|---|---|---|---|---|
ΔrH° | 1681. ± 13. | kJ/mol | G+TS | Dahlke and Kass, 1992 | gas phase; Acid: anisole. Between o-OMe-phenide and Me2NH.; B |
Quantity | Value | Units | Method | Reference | Comment |
ΔrG° | 1648. ± 13. | kJ/mol | IMRB | Dahlke and Kass, 1992 | gas phase; Acid: anisole. Between o-OMe-phenide and Me2NH.; B |

Gas phase thermochemistry data

Data compiled as indicated in comments:
ALS - Hussein Y. Afeefy, Joel F. Liebman, and Stephen E. Stein
DRB - Donald R. Burgess, Jr.
GT - Glushko Thermocenter, Russian Academy of Sciences, Moscow
Quantity | Value | Units | Method | Reference | Comment |
---|---|---|---|---|---|
ΔfH°gas | -16.24 ± 0.29 | kcal/mol | Ccb | Fenwick, Harrop, et al., 1975 | Author was aware that data differs from previously reported values; ALS |
ΔfH°gas | -18.33 ± 0.22 | kcal/mol | Ccb | Lebedeva and Katin, 1972 | Reanalyzed by Pedley, Naylor, et al., 1986, Original value = -19.6 ± 0.3 kcal/mol; ALS |
ΔfH°gas | -16.9 | kcal/mol | Ccb | Gray and Williams, 1959 | Private communication; ALS |
ΔfH°gas | -17.9 | kcal/mol | N/A | Badoche, 1941 | Value computed using ΔfHliquid° value of -118.4 kj/mol from Badoche, 1941 and ΔvapH° value of 43.3 kj/mol from Lebedeva and Katin, 1972.; DRB |
Constant pressure heat capacity of gas
Cp,gas (cal/mol*K) | Temperature (K) | Reference | Comment |
---|---|---|---|
38.829 | 388.15 | Hales J.L., 1967 | GT |
40.349 | 408.15 | ||
42.299 | 433.15 | ||
43.750 | 453.15 | ||
45.170 | 473.15 | ||
46.831 | 498.15 |

Condensed phase thermochemistry data

Data compiled as indicated in comments:
ALS - Hussein Y. Afeefy, Joel F. Liebman, and Stephen E. Stein
DH - Eugene S. Domalski and Elizabeth D. Hearing
Quantity | Value | Units | Method | Reference | Comment |
---|---|---|---|---|---|
ΔfH°liquid | -27.43 ± 0.28 | kcal/mol | Ccb | Fenwick, Harrop, et al., 1975 | Author was aware that data differs from previously reported values; ALS |
ΔfH°liquid | -28.7 ± 0.2 | kcal/mol | Ccb | Lebedeva and Katin, 1972 | ALS |
ΔfH°liquid | -28.30 | kcal/mol | Ccb | Badoche, 1941 | Author's hf298_condensed=-31.02 kcal/mol; ALS |
Quantity | Value | Units | Method | Reference | Comment |
ΔcH°liquid | -904.187 | kcal/mol | Ccb | Fenwick, Harrop, et al., 1975 | Author was aware that data differs from previously reported values; Corresponding ΔfHºliquid = -27.431 kcal/mol (simple calculation by NIST; no Washburn corrections); ALS |
ΔcH°liquid | -902.9 ± 0.2 | kcal/mol | Ccb | Lebedeva and Katin, 1972 | Corresponding ΔfHºliquid = -28.7 kcal/mol (simple calculation by NIST; no Washburn corrections); ALS |
ΔcH°liquid | -903.32 | kcal/mol | Ccb | Badoche, 1941 | Author's hf298_condensed=-31.02 kcal/mol; Corresponding ΔfHºliquid = -28.30 kcal/mol (simple calculation by NIST; no Washburn corrections); ALS |
Constant pressure heat capacity of liquid
Cp,liquid (cal/mol*K) | Temperature (K) | Reference | Comment |
---|---|---|---|
47.56 | 298.15 | Fenwick, Harrop, et al., 1975, 2 | DH |
49.90 | 304.8 | Phillip, 1939 | DH |
45.70 | 297.2 | de Kolossowsky and Udowenko, 1933 | DH |

Phase change data

Data compiled as indicated in comments:
TRC - Thermodynamics Research Center, NIST Boulder Laboratories, Chris Muzny director
BS - Robert L. Brown and Stephen E. Stein
AC - William E. Acree, Jr., James S. Chickos
ALS - Hussein Y. Afeefy, Joel F. Liebman, and Stephen E. Stein
DRB - Donald R. Burgess, Jr.
DH - Eugene S. Domalski and Elizabeth D. Hearing
Quantity | Value | Units | Method | Reference | Comment |
---|---|---|---|---|---|
Tboil | 427.0 ± 0.9 | K | AVG | N/A | Average of 19 values; Individual data points |
Quantity | Value | Units | Method | Reference | Comment |
Tfus | 250. ± 40. | K | AVG | N/A | Average of 9 values; Individual data points |
Quantity | Value | Units | Method | Reference | Comment |
Tc | 643. ± 4. | K | AVG | N/A | Average of 6 values; Individual data points |
Quantity | Value | Units | Method | Reference | Comment |
Pc | 41.4 ± 0.5 | atm | AVG | N/A | Average of 6 values; Individual data points |
Quantity | Value | Units | Method | Reference | Comment |
ρc | 2.93 | mol/l | N/A | Wilson, Wilson, et al., 1996 | Uncertainty assigned by TRC = 0.092 mol/l; TRC |
Quantity | Value | Units | Method | Reference | Comment |
ΔvapH° | 11. ± 2. | kcal/mol | AVG | N/A | Average of 13 values; Individual data points |
Enthalpy of vaporization
ΔvapH (kcal/mol) | Temperature (K) | Method | Reference | Comment |
---|---|---|---|---|
9.314 | 426.8 | N/A | Majer and Svoboda, 1985 | |
9.99 | 397. | N/A | Reich and Sanhueza, 1993 | Based on data from 382. to 429. K.; AC |
10.0 | 397. | A | Stephenson and Malanowski, 1987 | Based on data from 382. to 437. K. See also Ambrose, Ellender, et al., 1976.; AC |
9.32 | 426. | N/A | Ambrose, Ellender, et al., 1976 | Based on data from 282. to 437. K.; AC |
10.3 ± 0.02 | 367. | C | Hales, Lees, et al., 1967 | AC |
10.0 ± 0.02 | 382. | C | Hales, Lees, et al., 1967 | AC |
9.68 ± 0.02 | 402. | C | Hales, Lees, et al., 1967 | AC |
9.30 ± 0.02 | 427. | C | Hales, Lees, et al., 1967 | AC |
10.0 | 397. | N/A | von Terres, Gebert, et al., 1955 | Based on data from 382. to 437. K. See also Collerson, Counsell, et al., 1965.; AC |
Enthalpy of vaporization
ΔvapH =
A exp(-βTr) (1 − Tr)β
ΔvapH =
Enthalpy of vaporization (at saturation pressure)
(kcal/mol)
Tr = reduced temperature (T / Tc)
View plot Requires a JavaScript / HTML 5 canvas capable browser.
Temperature (K) | A (kcal/mol) | β | Tc (K) | Reference | Comment |
---|---|---|---|---|---|
298. to 427. | 15.16 | 0.2787 | 644.1 | Majer and Svoboda, 1985 |
Antoine Equation Parameters
log10(P) = A − (B / (T + C))
P = vapor pressure (atm)
T = temperature (K)
View plot Requires a JavaScript / HTML 5 canvas capable browser.
Temperature (K) | A | B | C | Reference |
---|---|---|---|---|
383.03 to 437.26 | 4.17155 | 1489.756 | -69.607 | Collerson, Counsell, et al., 1965, 2 |
Enthalpy of fusion
ΔfusH (kcal/mol) | Temperature (K) | Reference | Comment |
---|---|---|---|
2.787 | 237. | Domalski and Hearing, 1996 | See also Lee, Lien, et al., 1994.; AC |
3.081 | 236. | Domalski and Hearing, 1996 | AC |
4.0700 | 293.2 | Eykman, 1889 | DH |
Entropy of fusion
ΔfusS (cal/mol*K) | Temperature (K) | Reference | Comment |
---|---|---|---|
13.9 | 293.2 | Eykman, 1889 | DH |
Enthalpy of phase transition
ΔHtrs (kcal/mol) | Temperature (K) | Initial Phase | Final Phase | Reference | Comment |
---|---|---|---|---|---|
3.0808 | 268.73 | crystaline, I | liquid | Goates, Boerio-Goates, et al., 1987 | DH |
Entropy of phase transition
ΔStrs (cal/mol*K) | Temperature (K) | Initial Phase | Final Phase | Reference | Comment |
---|---|---|---|---|---|
11.5 | 268.73 | crystaline, I | liquid | Goates, Boerio-Goates, et al., 1987 | DH |

Ion clustering data

Data compiled as indicated in comments:
B - John E. Bartmess
M - Michael M. Meot-Ner (Mautner) and Sharon G. Lias
RCD - Robert C. Dunbar
Clustering reactions
By formula: Br- + C7H8O = (Br- • C7H8O)
Quantity | Value | Units | Method | Reference | Comment |
---|---|---|---|---|---|
ΔrH° | 11.8 ± 1.8 | kcal/mol | IMRE | Paul and Kebarle, 1991 | gas phase; ΔGaff measured at 303 K, corrected to 423 K, ΔSaff taken as that of PhNO2..Br-; B,M |
Quantity | Value | Units | Method | Reference | Comment |
ΔrS° | 20. | cal/mol*K | N/A | Paul and Kebarle, 1991 | gas phase; Entropy change calculated or estimated; M |
Quantity | Value | Units | Method | Reference | Comment |
ΔrG° | 3.3 ± 1.0 | kcal/mol | IMRE | Paul and Kebarle, 1991 | gas phase; ΔGaff measured at 303 K, corrected to 423 K, ΔSaff taken as that of PhNO2..Br-; B |
Free energy of reaction
ΔrG° (kcal/mol) | T (K) | Method | Reference | Comment |
---|---|---|---|---|
3.3 | 423. | PHPMS | Paul and Kebarle, 1991 | gas phase; Entropy change calculated or estimated; M |
By formula: Cl- + C7H8O = (Cl- • C7H8O)
Quantity | Value | Units | Method | Reference | Comment |
---|---|---|---|---|---|
ΔrG° | 7.30 | kcal/mol | TDEq | French, Ikuta, et al., 1982 | gas phase; B |
Free energy of reaction
ΔrG° (kcal/mol) | T (K) | Method | Reference | Comment |
---|---|---|---|---|
7.3 | 300. | PHPMS | French, Ikuta, et al., 1982 | gas phase; M |
By formula: Cs+ + C7H8O = (Cs+ • C7H8O)
Quantity | Value | Units | Method | Reference | Comment |
---|---|---|---|---|---|
ΔrH° | 15.9 ± 1.2 | kcal/mol | CIDT | Amunugama and Rodgers, 2003 | RCD |
By formula: (Cs+ • C7H8O) + C7H8O = (Cs+ • 2C7H8O)
Quantity | Value | Units | Method | Reference | Comment |
---|---|---|---|---|---|
ΔrH° | 14.7 ± 0.9 | kcal/mol | CIDT | Amunugama and Rodgers, 2003 | RCD |
By formula: K+ + C7H8O = (K+ • C7H8O)
Quantity | Value | Units | Method | Reference | Comment |
---|---|---|---|---|---|
ΔrH° | 18.9 ± 0.7 | kcal/mol | CIDT | Amunugama and Rodgers, 2003 | RCD |
By formula: (K+ • C7H8O) + C7H8O = (K+ • 2C7H8O)
Quantity | Value | Units | Method | Reference | Comment |
---|---|---|---|---|---|
ΔrH° | 16.7 ± 0.6 | kcal/mol | CIDT | Amunugama and Rodgers, 2003 | RCD |
By formula: Li+ + C7H8O = (Li+ • C7H8O)
Quantity | Value | Units | Method | Reference | Comment |
---|---|---|---|---|---|
ΔrH° | 44.1 ± 4.5 | kcal/mol | CIDT | Amunugama and Rodgers, 2003 | RCD |
By formula: (Li+ • C7H8O) + C7H8O = (Li+ • 2C7H8O)
Quantity | Value | Units | Method | Reference | Comment |
---|---|---|---|---|---|
ΔrH° | 29.0 ± 0.9 | kcal/mol | CIDT | Amunugama and Rodgers, 2003 | RCD |
By formula: Na+ + C7H8O = (Na+ • C7H8O)
Quantity | Value | Units | Method | Reference | Comment |
---|---|---|---|---|---|
ΔrH° | 27.1 ± 2.0 | kcal/mol | CIDT | Amunugama and Rodgers, 2003 | RCD |
By formula: (Na+ • C7H8O) + C7H8O = (Na+ • 2C7H8O)
Quantity | Value | Units | Method | Reference | Comment |
---|---|---|---|---|---|
ΔrH° | 21.4 ± 0.6 | kcal/mol | CIDT | Amunugama and Rodgers, 2003 | RCD |
By formula: Rb+ + C7H8O = (Rb+ • C7H8O)
Quantity | Value | Units | Method | Reference | Comment |
---|---|---|---|---|---|
ΔrH° | 17.3 ± 1.0 | kcal/mol | CIDT | Amunugama and Rodgers, 2003 | RCD |
By formula: (Rb+ • C7H8O) + C7H8O = (Rb+ • 2C7H8O)
Quantity | Value | Units | Method | Reference | Comment |
---|---|---|---|---|---|
ΔrH° | 15.2 ± 0.8 | kcal/mol | CIDT | Amunugama and Rodgers, 2003 | RCD |

Kovats' RI, non-polar column, isothermal

View large format table.

Column type Active phase Temperature (C) I Reference Comment
CapillaryZB-1100.891.69Hoskovec, Grygarová, et al., 200530. m/0.32 mm/0.25 μm, He
CapillaryZB-1110.893.73Hoskovec, Grygarová, et al., 200530. m/0.32 mm/0.25 μm, He
CapillaryZB-1120.895.86Hoskovec, Grygarová, et al., 200530. m/0.32 mm/0.25 μm, He
CapillaryZB-1130.897.86Hoskovec, Grygarová, et al., 200530. m/0.32 mm/0.25 μm, He
CapillaryZB-1140.900.Hoskovec, Grygarová, et al., 200530. m/0.32 mm/0.25 μm, He
CapillaryZB-1150.902.32Hoskovec, Grygarová, et al., 200530. m/0.32 mm/0.25 μm, He
CapillaryZB-1160.904.91Hoskovec, Grygarová, et al., 200530. m/0.32 mm/0.25 μm, He
CapillaryZB-1170.907.48Hoskovec, Grygarová, et al., 200530. m/0.32 mm/0.25 μm, He
CapillaryZB-1180.909.99Hoskovec, Grygarová, et al., 200530. m/0.32 mm/0.25 μm, He
CapillaryZB-1190.912.78Hoskovec, Grygarová, et al., 200530. m/0.32 mm/0.25 μm, He
CapillaryZB-190.889.68Hoskovec, Grygarová, et al., 200530. m/0.32 mm/0.25 μm, He
PackedC78, Branched paraffin130.909.0Dallos, Sisak, et al., 2000He; Column length: 3.3 m
CapillarySE-30100.901.9Tudor, 199740. m/0.35 mm/0.35 μm
PackedOV-101100.903.8Righezza, Hassani, et al., 1996N2, Chromosorb G HP; Column length: 5. m
PackedOV-101110.908.8Righezza, Hassani, et al., 1996N2, Chromosorb G HP; Column length: 5. m
PackedOV-10180.898.1Righezza, Hassani, et al., 1996N2, Chromosorb G HP; Column length: 5. m
PackedOV-10190.901.Righezza, Hassani, et al., 1996N2, Chromosorb G HP; Column length: 5. m
PackedOV-101120.910.1Hassani and Meklati, 1992N2, Chromosorb G HP; Column length: 5. m
PackedC78, Branched paraffin130.909.4Reddy, Dutoit, et al., 1992Chromosorb G HP; Column length: 3.3 m
PackedApolane130.911.Dutoit, 1991Column length: 3.7 m
PackedApolane150.928.Evans and Haken, 1987He, Chromosorb G AW DCMS; Column length: 3.7 m
PackedApolane150.928.Haken and Vernon, 1986Chromosorb G AW DCMS; Column length: 3.7 m
PackedSE-30180.927.Oszczapowicz, Osek, et al., 1985N2, Chromosorb A AW; Column length: 3. m
CapillarySE-30140.887.Korhonen, 1984N2; Column length: 25. m; Column diameter: 0.3 mm
CapillarySE-30160.880.Korhonen, 1984N2; Column length: 25. m; Column diameter: 0.3 mm
CapillarySE-30180.900.Korhonen, 1984N2; Column length: 25. m; Column diameter: 0.3 mm
PackedSE-30180.927.Oszczapowicz, Osek, et al., 1984N2, Chromosorb W AW; Column length: 3. m
PackedSE-30150.915.Tiess, 1984Ar, Gas Chrom Q (80-100 mesh); Column length: 3. m
PackedSE-30100.916.Winskowski, 1983Gaschrom Q; Column length: 2. m
PackedApiezon L100.919.Bogoslovsky, Anvaer, et al., 1978Chromatone N AW DNCS
PackedApiezon L150.935.Bogoslovsky, Anvaer, et al., 1978Chromatone N AW DNCS
PackedApiezon L180.940.Vernon and Edwards, 1975N2, Celite; Column length: 1. m
PackedSE-30150.913.Tibor and Anna, 1971N2, Chromosorb W-AW; Column length: 2. m
PackedSE-30170.930.Tibor and Anna, 1971N2, Chromosorb W-AW; Column length: 2. m
PackedApiezon L130.930.Wehrli and Kováts, 1959Celite; Column length: 2.25 m

Kovats' RI, non-polar column, custom temperature program

View large format table.

Column type Active phase I Reference Comment
PackedApiezon M923.6Jalali-Heravi and Garkani-Nejad, 1993Chromosorb W; Column length: 2. m; Program: not specified

Kovats' RI, polar column, isothermal

View large format table.

Column type Active phase Temperature (C) I Reference Comment
PackedCarbowax 20M150.1340.Haken and Vernon, 1986Chromosorb G AW DCMS; Column length: 3.7 m; Column diameter: 6.4 mm
CapillaryOV-351140.1375.Korhonen, 1984N2; Column length: 25. m; Column diameter: 0.32 mm
CapillaryOV-351160.1373.Korhonen, 1984N2; Column length: 25. m; Column diameter: 0.32 mm
CapillaryOV-351180.1331.Korhonen, 1984N2; Column length: 25. m; Column diameter: 0.32 mm
PackedPEG-20M160.1368.6Still and Whitehead, 1977N2, Chromosorb G; Column length: 3. m
PackedPEG-20M160.1368.6Still and Whitehead, 1977N2, Chromosorb G; Column length: 3. m
PackedPEG-20M150.1394.Tibor and Anna, 1971N2, Chromosorb W-AW; Column length: 2. m
PackedPEG-20M170.1398.Tibor and Anna, 1971N2, Chromosorb W-AW; Column length: 2. m

Van Den Dool and Kratz RI, non-polar column, temperature ramp

View large format table.

Column type Active phase I Reference Comment
CapillaryHP-5920.Flamini, Tebano, et al., 200630. m/0.25 mm/0.25 μm, N2, 60. C @ 10. min, 5. K/min; Tend: 220. C
CapillaryPetrocol DH898.4Censullo, Jones, et al., 200350. m/0.25 mm/0.5 μm, He, 35. C @ 10. min, 3. K/min, 200. C @ 10. min
CapillaryHP-5918.Ertugrul, Dural, et al., 200330. m/0.25 mm/0.25 μm, N2, 60. C @ 10. min, 5. K/min; Tend: 220. C
CapillaryDB-5915.Dallüge, van Stee, et al., 200230. m/0.25 mm/1. μm, He, 2.5 K/min; Tstart: 50. C; Tend: 200. C
CapillaryHP-5923.David, Scanlan, et al., 200050. m/0.32 mm/1.05 μm, He, 2. K/min; Tstart: 50. C; Tend: 290. C
CapillaryDB-1900.3Helmig, Klinger, et al., 199960. m/0.32 mm/1. μm, -50. C @ 2. min, 6. K/min; Tend: 175. C
CapillaryOV-1893.9Gautzsch and Zinn, 19968. K/min; Tstart: 35. C; Tend: 300. C
CapillarySE-30908.Korhonen, 1984N2, 10. K/min; Column length: 25. m; Column diameter: 0.3 mm; Tstart: 100. C
CapillarySE-30907.Korhonen, 1984N2, 2. K/min; Column length: 25. m; Column diameter: 0.3 mm; Tstart: 100. C
CapillarySE-30906.Korhonen, 1984N2, 6. K/min; Column length: 25. m; Column diameter: 0.3 mm; Tstart: 100. C
PackedSE-30902.van den Dool and Kratz, 1963Celite; Tstart: 75. C; Tend: 228. C

Van Den Dool and Kratz RI, polar column, temperature ramp

View large format table.

Column type Active phase I Reference Comment
CapillaryHP-Wax1325.Flamini, Tebano, et al., 200630. m/0.25 mm/0.25 μm, N2, 60. C @ 10. min, 5. K/min; Tend: 220. C
CapillarySupelcowax-101354.Matiella and Hsieh, 199060. m/0.25 mm/0.25 μm, 40. C @ 5. min, 2. K/min, 175. C @ 20. min
CapillaryPEG-20M1355.4Wang and Sun, 198725. m/0.26 mm/0.3 μm, 2. K/min; Tstart: 100. C; Tend: 200. C
CapillaryPEG-20M1345.6Wang and Sun, 198725. m/0.26 mm/0.3 μm, 2. K/min; Tstart: 60. C; Tend: 200. C
CapillaryPEG-20M1356.8Wang and Sun, 198725. m/0.26 mm/0.3 μm, 8. K/min; Tstart: 60. C; Tend: 200. C
CapillaryPEG-20M1353.8Wang and Sun, 19852. K/min; Column length: 62. m; Column diameter: 0.27 mm; Tstart: 100. C
CapillaryPEG-20M1348.2Wang and Sun, 19853. K/min; Column length: 62. m; Column diameter: 0.27 mm; Tstart: 70. C
CapillaryPEG-20M1351.0Wang and Sun, 19854. K/min; Column length: 62. m; Column diameter: 0.27 mm; Tstart: 70. C
CapillaryPEG-20M1348.0Wang and Sun, 19852. K/min; Column length: 62. m; Column diameter: 0.27 mm; Tstart: 80. C
CapillaryPEG-20M1350.9Wang and Sun, 19852. K/min; Column length: 62. m; Column diameter: 0.27 mm; Tstart: 90. C
CapillaryOV-3511349.Korhonen, 1984N2, 10. K/min; Column length: 25. m; Column diameter: 0.32 mm; Tstart: 100. C
CapillaryOV-3511342.Korhonen, 1984N2, 2. K/min; Column length: 25. m; Column diameter: 0.32 mm; Tstart: 100. C
CapillaryOV-3511344.Korhonen, 1984N2, 6. K/min; Column length: 25. m; Column diameter: 0.32 mm; Tstart: 100. C
PackedCarbowax 20M1341.van den Dool and Kratz, 1963Celite 545, 4.6 K/min; Tstart: 75. C; Tend: 228. C

Van Den Dool and Kratz RI, polar column, custom temperature program

View large format table.

Column type Active phase I Reference Comment
CapillarySupelcowax-101355.Bianchi, Cantoni, et al., 200730. m/0.25 mm/0.25 μm; Program: 35C(8min) => 4C/min => 60C => 6C/min => 160C => 20C/min => 220C(1min)
CapillarySupelcowax-101355.Bianchi, Careri, et al., 200730. m/0.25 mm/0.25 μm, He; Program: 35C(8min) => 4C/min => 60C => 6C/min => 160C => 20C/min => 200C(1min)
CapillarySupelcowax-101355.Bianchi, Careri, et al., 200730. m/0.25 mm/0.25 μm, He; Program: 35C(8min) => 4C/min => 60C => 6C/min => 160C => 20C/min => 200C(1min)

Normal alkane RI, non-polar column, isothermal

View large format table.

Column type Active phase Temperature (C) I Reference Comment
PackedApieson L140.956.Hedin, Minyard, et al., 1967Nitrogen, Chromosorb W HMDS (60-80 mesh); Column length: 1.8 m

Normal alkane RI, non-polar column, temperature ramp

View large format table.

Column type Active phase I Reference Comment
CapillaryVF-5 MS918.Leffingwell and Alford, 201160. m/0.32 mm/0.25 μm, Helium, 2. K/min, 260. C @ 28. min; Tstart: 30. C
CapillaryVF-5 MS921.Leffingwell and Alford, 201160. m/0.32 mm/0.25 μm, Helium, 2. K/min, 260. C @ 28. min; Tstart: 30. C
CapillaryUltra-ALLOY-5920.Tsuge, Ohtan, et al., 201130. m/0.25 mm/0.25 μm, 40. C @ 2. min, 20. K/min, 320. C @ 13. min
CapillaryZB-5918.Harrison and Priest, 200930. m/0.25 mm/0.25 μm, Helium, 40. C @ 1. min, 6. K/min, 280. C @ 9. min
CapillaryHP-5918.Isidorov and Jdanova, 20023. K/min; Column length: 30. m; Column diameter: 0.25 mm; Tstart: 50. C; Tend: 200. C
CapillaryDB-1900.Guy and Vernin, 1996He, 70. C @ 5. min, 3. K/min; Column length: 30. m; Column diameter: 0.25 mm; Tend: 300. C
CapillaryOV-101900.Egolf and Jurs, 19932. K/min; Column length: 50. m; Column diameter: 0.22 mm; Tstart: 80. C; Tend: 200. C

Normal alkane RI, non-polar column, custom temperature program

View large format table.

Column type Active phase I Reference Comment
CapillaryPolydimethyl siloxane with 5 % Ph groups920.Robinson, Adams, et al., 2012Program: not specified
CapillaryPolydimethyl siloxane with 5 % Ph groups922.Robinson, Adams, et al., 2012Program: not specified
CapillaryCP-Sil925.Proffit, 200730. m/0.25 mm/0.25 μm, Helium; Program: 50 0C (3 min) 3 0C/min -> 100 0C 2.7 0C/min -> 140 0C 2.4 0C/min -> 180 0C 6 0C/min -> 250 0C
CapillaryOV-101910.Ebrahimi and Hadjmohammadi, 2006Program: not specified
CapillarySE-30900.Vinogradov, 2004Program: not specified
CapillaryHP-5923.0David, Scanlan, et al., 200250. m/0.32 mm/1.05 μm, He; Program: not specified
CapillaryPolydimethyl siloxane900.Spanier, Shahidi, et al., 2001Program: not specified
CapillaryRSL-150896.Buchbauer, Nikiforov, et al., 199460. m/0.32 mm/0.25 μm, He; Program: 30c (1.5min) => 20C/min => 55C => 6C/min => 200C(10min)
CapillarySE-30900.Lou, Liu, et al., 1993Column diameter: 0.25 mm; Program: not specified
CapillarySE-30893.Ibrahim and Suffet, 1988N2; Column length: 60. m; Column diameter: 0.32 mm; Program: 50C(8min) => 3C/min => 150C => 35C/min => 275C (10min)
CapillaryOV-101900.Shibamoto, 1987Program: not specified
CapillaryOV-1, SE-30, Methyl silicone, SP-2100, OV-101, DB-1, etc.916.Waggott and Davies, 1984Hydrogen; Column length: 50. m; Column diameter: 0.32 mm; Program: not specified

Normal alkane RI, polar column, temperature ramp

View large format table.

Column type Active phase I Reference Comment
CapillaryAT-Wax1310.Kiss, Csoka, et al., 201160. m/0.25 mm/0.25 μm, Helium, 4. K/min; Tstart: 60. C; Tend: 280. C
CapillaryCP-Wax 52CB1327.Rohloff and Bones, 200530. m/0.32 mm/0.25 μm, He, 40. C @ 1. min, 4. K/min; Tend: 220. C
CapillaryCP-Wax 52CB1327.Rohloff and Bones, 200530. m/0.32 mm/0.25 μm, He, 40. C @ 1. min, 4. K/min; Tend: 220. C
CapillarySupelcowax-101336.Wong and Lai, 199660. m/0.25 mm/0.25 μm, He, 40. C @ 3. min, 3. K/min, 200. C @ 30. min
CapillaryCarbowax 20M1327.Egolf and Jurs, 19932. K/min; Column length: 80. m; Column diameter: 0.2 mm; Tstart: 70. C; Tend: 170. C
PackedCarbowax 20M1358.Stancher and Pertoldi, 1967Hydrogen, Gas-Chrom Z (80-100 mesh), 4. K/min; Column length: 2. m; Tstart: 65. C; Tend: 220. C

Normal alkane RI, polar column, custom temperature program

View large format table.

Column type Active phase I Reference Comment
CapillaryCarbowax 20M1327.Vinogradov, 2004Program: not specified
CapillaryDB-Wax1306.Caldentey, Daria Fumi, et al., 199830. m/0.25 mm/0.25 μm, He; Program: 25C(8min) => 4C/min => 60C => 6C/min => 160C => 20C/min => 200C
CapillaryDB-Wax1340.Peng, Yang, et al., 1991Program: not specified
CapillaryCarbowax 20M1327.Shibamoto, 1987Program: not specified
CapillarySuperox 0.6; Carbowax 20M1330.Waggott and Davies, 1984Hydrogen; Column length: 50. m; Column diameter: 0.32 mm; Program: not specified
CapillarySuperox 0.6; Carbowax 20M1341.Waggott and Davies, 1984Hydrogen; Column length: 50. m; Column diameter: 0.32 mm; Program: not specified

References

Paul and Kebarle, 1991
Paul, G.J.C.; Kebarle, P.,
Stabilities of Complexes of Br- with Substituted Benzenes (SB) Based on Determinations of the Gas-Phase Equilibria Br- + SB = (BrSB)-,
J. Am. Chem. Soc., 1991, 113, 4, 1148, https://doi.org/10.1021/ja00004a014
. [all data]
Dahlke and Kass, 1992
Dahlke, G.D.; Kass, S.R.,
The Ortho-dehydrophenoxy Anion,
Int. J. Mass Spectrom. Ion Proc., 1992, 117, 633, https://doi.org/10.1016/0168-1176(92)80117-J
. [all data]
French, Ikuta, et al., 1982
French, M.A.; Ikuta, S.; Kebarle, P.,
Hydrogen bonding of O-H and C-H hydrogen donors to Cl-. Results from mass spectrometric measurement of the ion-molecule equilibria RH + Cl- = RHCl-,
Can. J. Chem., 1982, 60, 1907. [all data]
Brennan and Ubbelohde, 1956
Brennan, D.; Ubbelohde, A.R.,
A thermochemical evaluation of bond strengths in some carbon compounds. Part IV. Bond-strength differences based on the reaction: RI + HI = RH + I2, where R = p-methoxyphenyl and cyclohexyl,
J. Chem. Soc., 1956, 3011-3016. [all data]
Amunugama and Rodgers, 2003
Amunugama, R.; Rodgers, M.T.,
Influence of substituents on cation-pi interactions - 5. Absolute binding energies of alkali metal cation-anisole complexes determined by threshold collision-induced dissociation and theoretical studies,
Int. J. Mass Spectrom., 2003, 222, 1-3, 431, https://doi.org/10.1016/S1387-3806(02)00945-4
. [all data]
Hunter and Lias, 1998
Hunter, E.P.; Lias, S.G.,
Evaluated Gas Phase Basicities and Proton Affinities of Molecules: An Update,
J. Phys. Chem. Ref. Data, 1998, 27, 3, 413-656, https://doi.org/10.1063/1.556018
. [all data]
Ponomarev, Arapov, et al., 1986
Ponomarev, D.A.; Arapov, O.V.; Sergeev, Y.L.; Chistyakov, A.B.,
[Title unavailable],
Izv. Vyssh. Uchebn. Zaved., Khim. Khim. Tekhnol., 1986, 29, 107. [all data]
Klasinc, Kovac, et al., 1983
Klasinc, L.; Kovac, B.; Gusten, H.,
Photoelectron spectra of acenes. Electronic structure and substituent effects,
Pure Appl. Chem., 1983, 55, 289. [all data]
Behan, Johnstone, et al., 1976
Behan, J.M.; Johnstone, R.A.W.; Bentley, T.W.,
An evaluation of empirical methods for calculating the ionization potentials of substituted benzenes,
Org. Mass Spectrom., 1976, 11, 207. [all data]
McLafferty, Bente, et al., 1973
McLafferty, F.W.; Bente, P.F., III; Kornfeld, R.; Tsai, S.-C.; Howe, I.,
Collisional activation spectra of organic ions,
J. Am. Chem. Soc., 1973, 95, 2120. [all data]
Maier and Turner, 1973
Maier, J.P.; Turner, D.W.,
Steric inhibition of resonance studied by molecular photoelectron spectroscopy Part 3. Anilines, Phenols and Related Compounds,
J. Chem. Soc. Faraday Trans. 2, 1973, 69, 521. [all data]
Kobayashi, Kobayashi, et al., 1973
Kobayashi, H.; Kobayashi, M.; Kaizu, Y.,
Molecular complexes of arenetricarbonylchromium,
Bull. Chem. Soc. Jpn., 1973, 46, 3109. [all data]
Gilbert, Leach, et al., 1973
Gilbert, J.R.; Leach, W.P.; Miller, J.R.,
Ionisation appearance potential measurements in arene chromium tricarbonyls,
J. Organomet. Chem., 1973, 49, 219. [all data]
Cooks, Bertrand, et al., 1973
Cooks, R.G.; Bertrand, M.; Beynon, J.H.; Rennekamp, M.E.; Setser, D.W.,
Energy partitioning data as an ion structure probe. Substituted anisoles,
J. Am. Chem. Soc., 1973, 95, 1732. [all data]
Pitt, Carey, et al., 1972
Pitt, C.G.; Carey, R.N.; Toren, E.C.,
Nature of the electronic interactions in aryl-substituted polysilanes,
J. Am. Chem. Soc., 1972, 94, 3806. [all data]
Gross, 1972
Gross, M.L.,
Ion cyclotron resonance spectrometry. A means of evaluating 'kinetic shifts',
Org. Mass Spectrom., 1972, 6, 827. [all data]
Brown, 1970
Brown, P.,
Kinetic studies in mass spectrometry. VIII. Competing [M-CH3] and [M-CH2O] reactions in substituted anisoles. Approximate activation energies from ionization appearance potentials,
Org. Mass Spectrom., 1970, 4, 519. [all data]
Dewar and Worley, 1969
Dewar, M.J.S.; Worley, S.D.,
Photoelectron spectra of molecules. I. Ionization potentials of some organic molecules and their interpretation,
J. Chem. Phys., 1969, 50, 654. [all data]
Williams, Cooks, et al., 1968
Williams, D.H.; Cooks, R.G.; Howe, I.,
Studies in mass spectrometry. XXXI. A comparison of reaction rates in common ions generated via fragmentation and direct ionization,
J. Am. Chem. Soc., 1968, 90, 6759. [all data]
Watanabe, Nakayama, et al., 1962
Watanabe, K.; Nakayama, T.; Mottl, J.,
Ionization potentials of some molecules,
J. Quant. Spectry. Radiative Transfer, 1962, 2, 369. [all data]
Watanabe, 1957
Watanabe, K.,
Ionization potentials of some molecules,
J. Chem. Phys., 1957, 26, 542. [all data]
Friege and Klessinger, 1979
Friege, H.; Klessinger, M.,
Elektronenstruktur von Alkyl-aryl- und Alkyl-vinyl-ethern,
Chem. Ber., 1979, 112, 1614. [all data]
Kobayashi, 1978
Kobayashi, T.,
A simple general tendency in photoelectron angular distributions of some monosubstituted benzenes,
Phys. Lett., 1978, 69, 105. [all data]
Benoit and Harrison, 1977
Benoit, F.M.; Harrison, A.G.,
Predictive value of proton affinity. Ionization energy correlations involving oxygenated molecules,
J. Am. Chem. Soc., 1977, 99, 3980. [all data]
Kobayashi and Nagakura, 1974
Kobayashi, T.; Nagakura, S.,
Photoelectron spectra of substituted benzenes,
Bull. Chem. Soc. Jpn., 1974, 47, 2563. [all data]
Dewar, Ernstbrunner, et al., 1974
Dewar, P.S.; Ernstbrunner, E.; Gilmore, J.R.; Godfrey, M.; Mellor, J.M.,
Conformational analysis of alkyl aryl ethers and alkyl aryl sulphides by photoelectron spectroscopy,
Tetrahedron, 1974, 30, 2455. [all data]
Bock and Wagner, 1972
Bock, H.; Wagner, G.,
Electron lone pairs in organic sulfides and disulfides,
Angew. Chem. Int. Ed. Engl., 1972, 11, 119. [all data]
Das, Gilman, et al., 1986
Das, P.R.; Gilman, J.P.; Meisels, G.G.,
Unimolecular decomposition of energy-selected anisole ions. Breakdown graph and metastable decay rates,
Int. J. Mass Spectrom. Ion Processes, 1986, 68, 155. [all data]
Harrison, Haynes, et al., 1965
Harrison, A.G.; Haynes, P.; McLean, S.; Meyer, F.,
The mass spectra of methyl-substituted cyclopentadienes,
J. Am. Chem. Soc., 1965, 87, 5099. [all data]
Fisher, Palmer, et al., 1964
Fisher, I.P.; Palmer, T.F.; Lossing, F.P.,
The vertical ionization potentials of phenyl and phenoxy radicals,
J. Am. Chem. Soc., 1964, 86, 2741. [all data]
Tait, Shannon, et al., 1962
Tait, J.M.S.; Shannon, T.W.; Harrison, A.G.,
The structure of substituted C7 ions from benzyl derivatives at the appearance potential threshold,
J. Am. Chem. Soc., 1962, 84, 4. [all data]
Ziesel and Lifshitz, 1987
Ziesel, J.P.; Lifshitz, C.,
Time-dependent mass spectra and breakdown graphs. 10. Dissociative photoionization of anisole,
Chem. Phys., 1987, 117, 227. [all data]
Howe and Williams, 1969
Howe, I.; Williams, D.H.,
Calculation and qualitative predictions of mass spectra. Mono- and paradisubstituted benzenes,
J. Am. Chem. Soc., 1969, 91, 7137. [all data]