Cyclohexanone, oxime
- Formula: C6H11NO
- Molecular weight: 113.1576
- IUPAC Standard InChIKey: VEZUQRBDRNJBJY-UHFFFAOYSA-N
- CAS Registry Number: 100-64-1
- Chemical structure:
View 3d structure (requires JavaScript / HTML 5) - Other names: (Hydroxyimino)cyclohexane; Antioxidant D; NSC 6300

Gas phase thermochemistry data

Data compiled by: Hussein Y. Afeefy, Joel F. Liebman, and Stephen E. Stein
Quantity | Value | Units | Method | Reference | Comment |
---|---|---|---|---|---|
ΔfH°gas | -74.88 | kJ/mol | Ccb | Kozyro, Kabo, et al., 1992 | see Kozyro, Marachuk, et al., 1989 |

Condensed phase thermochemistry data

Data compiled as indicated in comments:
ALS - Hussein Y. Afeefy, Joel F. Liebman, and Stephen E. Stein
DH - Eugene S. Domalski and Elizabeth D. Hearing
Quantity | Value | Units | Method | Reference | Comment |
---|---|---|---|---|---|
ΔfH°solid | -153.2 ± 2.5 | kJ/mol | Ccb | Kozyro, Kabo, et al., 1992 | see Kozyro, Marachuk, et al., 1989; ALS |
Quantity | Value | Units | Method | Reference | Comment |
ΔcH°solid | -3779.9 ± 2.3 | kJ/mol | Ccb | Kozyro, Kabo, et al., 1992 | see Kozyro, Marachuk, et al., 1989; ALS |
ΔcH°solid | -3723. ± 4.2 | kJ/mol | Ccb | Runge and Maass, 1953 | At 293 °K; ALS |
Quantity | Value | Units | Method | Reference | Comment |
S°solid,1 bar | 185.08 | J/mol*K | N/A | Kozyro, Kabo, et al., 1992 | DH |
S°solid,1 bar | 185.12 | J/mol*K | N/A | Kozyro, Sheiman, et al., 1991 | DH |
Constant pressure heat capacity of solid
Cp,solid (J/mol*K) | Temperature (K) | Reference | Comment |
---|---|---|---|
199.38 | 298.15 | Kozyro, Kabo, et al., 1992 | T = 6 to 450 K. Cp(c, 300 to 340 K) = -143.81 + 1.6984(T/K) - 1.8334x10-3(T/K)2; CP(liq, 380 to 430 K) = 214.30 + 0.1900(T/K) J/mol*K.; DH |
199.34 | 298.15 | Kozyro, Sheiman, et al., 1991 | T = 6 to 430 K. Cp(c,J/mol*K) = -143.81 + 1.6984T - 1.8334x10-3xT2 (300 to 340 K); Cp(liq,J/mol*K) = 214.30 + 0.1900T (380 to 430 K).; DH |

Phase change data

Data compiled as indicated in comments:
BS - Robert L. Brown and Stephen E. Stein
TRC - Thermodynamics Research Center, NIST Boulder Laboratories, Chris Muzny director
AC - William E. Acree, Jr., James S. Chickos
DH - Eugene S. Domalski and Elizabeth D. Hearing
ALS - Hussein Y. Afeefy, Joel F. Liebman, and Stephen E. Stein
Quantity | Value | Units | Method | Reference | Comment |
---|---|---|---|---|---|
Tboil | 481.2 | K | N/A | Weast and Grasselli, 1989 | BS |
Quantity | Value | Units | Method | Reference | Comment |
Tfus | 362. | K | N/A | White and Bishop, 1940 | Uncertainty assigned by TRC = 4. K; TRC |
Quantity | Value | Units | Method | Reference | Comment |
Ttriple | 362.5 | K | N/A | Kozyro, Kabo, et al., 1992 | Crystal phase 1 phase; Uncertainty assigned by TRC = 0.3 K; TRC |
Ttriple | 362.5 | K | N/A | Kozyro, Sheiman, et al., 1991, 2 | Crystal phase 1 phase; Uncertainty assigned by TRC = 0.5 K; TRC |
Quantity | Value | Units | Method | Reference | Comment |
ΔvapH° | 63.1 ± 1.0 | kJ/mol | N/A | Steele, Chirico, et al., 2002 | Based on data from 370. to 385. K.; AC |
Quantity | Value | Units | Method | Reference | Comment |
ΔsubH° | 79.0 ± 2.0 | kJ/mol | N/A | Steele, Chirico, et al., 2002 | AC |
ΔsubH° | 78.32 ± 0.30 | kJ/mol | V | Kozyro, Kabo, et al., 1992 | see Kozyro, Marachuk, et al., 1989; ALS |
Enthalpy of vaporization
ΔvapH (kJ/mol) | Temperature (K) | Method | Reference | Comment |
---|---|---|---|---|
58.660 | 367.8 | N/A | Kozyro, Kabo, et al., 1992 | DH |
58.7 ± 0.6 | 368. | C | Kozyro, Kabo, et al., 1992 | AC |
59.5 ± 0.5 | 371. to 446. | N/A | Kozyro, Kabo, et al., 1992 | AC |
Enthalpy of sublimation
ΔsubH (kJ/mol) | Temperature (K) | Method | Reference | Comment |
---|---|---|---|---|
76.5 ± 1.0 | 378. | N/A | Steele, Chirico, et al., 2002 | AC |
74.0 ± 0.3 | 354. | C | Kozyro, Kabo, et al., 1992 | AC |
79.9 ± 0.7 | 317. | ME | Kozyro, Kabo, et al., 1992 | Based on data from 288. to 348. K.; AC |
Enthalpy of fusion
ΔfusH (kJ/mol) | Temperature (K) | Reference | Comment |
---|---|---|---|
12.45 | 362.2 | Zaitsau, Paulechka, et al., 2008 | AC |
12.7 | 362.5 | Steele, Chirico, et al., 2002 | AC |
12.7 | 362.6 | Kozyro, Kabo, et al., 1992 | AC |
Enthalpy of phase transition
ΔHtrs (kJ/mol) | Temperature (K) | Initial Phase | Final Phase | Reference | Comment |
---|---|---|---|---|---|
0.0140 | 240.8 | crystaline, III | crystaline, II | Kozyro, Kabo, et al., 1992 | DH |
0.0937 | 273.4 | crystaline, II | crystaline, I | Kozyro, Kabo, et al., 1992 | DH |
12.700 | 362.5 | crystaline, I | liquid | Kozyro, Kabo, et al., 1992 | DH |
74.010 | 353.7 | crystaline, I | Kozyro, Kabo, et al., 1992 | DH | |
0.0140 | 240.8 | crystaline, III | crystaline, II | Kozyro, Sheiman, et al., 1991 | DH |
0.0937 | 273.4 | crystaline, II | crystaline, I | Kozyro, Sheiman, et al., 1991 | DH |
12.700 | 362.5 | crystaline, I | liquid | Kozyro, Sheiman, et al., 1991 | DH |
Entropy of phase transition
ΔStrs (J/mol*K) | Temperature (K) | Initial Phase | Final Phase | Reference | Comment |
---|---|---|---|---|---|
0.06 | 240.8 | crystaline, III | crystaline, II | Kozyro, Kabo, et al., 1992 | DH |
0.34 | 273.4 | crystaline, II | crystaline, I | Kozyro, Kabo, et al., 1992 | DH |
0.06 | 240.8 | crystaline, III | crystaline, II | Kozyro, Sheiman, et al., 1991 | DH |
0.34 | 273.4 | crystaline, II | crystaline, I | Kozyro, Sheiman, et al., 1991 | DH |

Reaction thermochemistry data

Data compiled by: Hussein Y. Afeefy, Joel F. Liebman, and Stephen E. Stein
Individual Reactions
By formula: C6H11NO = C6H11NO
Quantity | Value | Units | Method | Reference | Comment |
---|---|---|---|---|---|
ΔrH° | -105.1 ± 4.2 | kJ/mol | Ciso | Kozyro, Marachuk, et al., 1989 | solid phase |

Gas phase ion energetics data

Data compiled by: Sharon G. Lias, Rhoda D. Levin, and Sherif A. Kafafi
Ionization energy determinations
IE (eV) | Method | Reference |
---|---|---|
8.97 ± 0.03 | PI | Golubitskii, Kulikov, et al., 1979 |

Normal alkane RI, non-polar column, temperature ramp

Column type | Active phase | I | Reference | Comment |
---|---|---|---|---|
Capillary | OV-101 | 1074. | Zenkevich, 2005 | 25. m/0.20 mm/0.10 μm, N2/He, 6. K/min; Tstart: 50. C; Tend: 250. C |

References

Kozyro, Kabo, et al., 1992
Kozyro, A.A.; Kabo, G.J.; Krouk, V.S.; Sheiman, M.S.; Yursha, I.A.; Simirsky, V.V.; Krasulin, A.P.; Sevruk, V.M.; Gogolinsky, V.I.,
Thermodynamic properties of cyclohexanone oxime,
J. Chem. Thermodyn., 1992, 24, 883-895. [all data]
Kozyro, Marachuk, et al., 1989
Kozyro, A.A.; Marachuk, L.I.; Krasulin, A.P.; Yursha, I.A.; Kabo, G.Ya.,
Thermodynamic properties of cyclohexanone oxime and ε-caprolactam,
J. Appl. Chem. USSR, 1989, 62, 547-550. [all data]
Runge and Maass, 1953
Runge, F.; Maass, P.,
Untersuchungen uber die Beckmann=Umlagerung des Zyklohexanonoxims,
Chem. Tech. (Berlin), 1953, 5, 421-424. [all data]
Kozyro, Sheiman, et al., 1991
Kozyro, A.A.; Sheiman, M.S.; Kabo, G.Ya.; Yursha, I.A.; Kruk, V.S.,
Heat capacity and thermodynamic properties of cyclohexanone oxime,
Zh. Prikl. Khim. (Leningrad), 1991, 64(8), 1704-1709. [all data]
Weast and Grasselli, 1989
CRC Handbook of Data on Organic Compounds, 2nd Editon, Weast,R.C and Grasselli, J.G., ed(s)., CRC Press, Inc., Boca Raton, FL, 1989, 1. [all data]
White and Bishop, 1940
White, A.H.; Bishop, W.S.,
Dielectric Evidence of Molecular Rotation in the Crystals of Certain Non-aromatic Compounds,
J. Am. Chem. Soc., 1940, 62, 8-16. [all data]
Kozyro, Sheiman, et al., 1991, 2
Kozyro, A.A.; Sheiman, M.S.; Kabo, G.Ya.; Yursha, I.A.; Krouk, V.S.,
Heat capacity and thermodynamic properties of cyclohexanone oxime,
Zh. Prikl. Khim. (S.-Peterburg), 1991, 64, 1704-9. [all data]
Steele, Chirico, et al., 2002
Steele, W.V.; Chirico, R.D.; Cowell, A.B.; Knipmeyer, S.E.; Nguyen, A.,
Thermodynamic Properties and Ideal-Gas Enthalpies of Formation for 1,4-Diisopropylbenzene, 1,2,4,5-Tetraisopropylbenzene, Cyclohexanone Oxime, Dimethyl Malonate, Glutaric Acid, and Pimelic Acid,
J. Chem. Eng. Data, 2002, 47, 4, 725-739, https://doi.org/10.1021/je010088b
. [all data]
Zaitsau, Paulechka, et al., 2008
Zaitsau, Dzmitry H.; Paulechka, Yauheni U.; Kabo, Gennady J.; Blokhin, Andrey V.; Emel'yanenko, Vladimir N.; Verevkin, Sergey P.; Heintz, Andreas,
Thermodynamics of Cyclohexanone Oxime,
J. Chem. Eng. Data, 2008, 53, 3, 694-703, https://doi.org/10.1021/je700546r
. [all data]
Golubitskii, Kulikov, et al., 1979
Golubitskii, A.E.; Kulikov, N.S.; Zyakun, A.M.; Valovoi, V.A.; Alekseev, A.M.; Volkov, V.N.,
Photoionization mass spectra of alicyclic compounds with various substituents, and their ionization energies and appearance energies,
Bull. Acad. Sci. USSR, Div. Chem. Sci., 1979, 11, 2602. [all data]
Huisgen, Rapp, et al., 1954
Huisgen, R.; Rapp, W.; Ugi, I.; Walz, H.; Mergenthaler, E.,
Mittlere ringe II. Sterische hinderung der mesomerie in 1,2-benzo-cyclen-3-onen und verwandten verbindungen,
Justus Liebigs Ann. Chem., 1954, 586, 1-29. [all data]
Zenkevich, 2005
Zenkevich, I.G.,
Experimentally measured retention indices., 2005. [all data]