4-Ethyl-2,6,7-trioxa-1-phosphabicyclo[2.2.2]octane 1-oxide
- Formula: C6H11O4P
- Molecular weight: 178.1229
- IUPAC Standard InChIKey: BYEFHDZWRALTEN-UHFFFAOYSA-N
- CAS Registry Number: 1005-93-2
- Chemical structure:
View 3d structure (requires JavaScript / HTML 5) - Other names: 2,6,7-Trioxa-1-phosphabicyclo[2.2.2]octane, 4-ethyl-, 1-oxide; 1,3-Propanediol, 2-ethyl-2-(hydroxymethyl)-, cyclic phosphate; 4-Aethyl-1-phospha-2,6,7-trioxabicyclo(2.2.2)octan-1-oxid; 2-Ethyl-2-(hydroxymethyl)-1,3-propanediol, cyclic phosphate (1:1); 4-Ethyl-1-phospha-2,6,7-trioxabicyclo(2.2.2)octane-1-oxide; 2-(Hydroxymethyl)-2-ethyl-1,3-propanediol, cyclic phosphate (1:1); TMP-P; Trimethyolpropane phosphate; Trimethylopropane phosphate; 1,3-Propanediol, 2-ethyl-2-(hydroxymethyl)-, cyclic phosphate (1:1); Trimethylolpropane phosphate

Van Den Dool and Kratz RI, non-polar column, temperature ramp

Column type | Active phase | I | Reference | Comment |
---|---|---|---|---|
Capillary | SE-54 | 1828. | Kostiainen, 2000 | 25. m/0.32 mm/0.25 μm, He, 40. C @ 1. min, 10. K/min, 280. C @ 10. min |

References

Kostiainen, 2000
Kostiainen, O.,
Gas Chromatography in Screening of Chemicals Related to the Chemical Weapons Convention
in Encyclopedia of Analytical Chemistry, Meyers, R.A., ed(s)., John Wiley Sons Ltd, Chichester, 2000, 963-979. [all data]