Mercury, chlorophenyl-
- Formula: C6H5ClHg
- Molecular weight: 313.15
- IUPAC Standard InChIKey: AWGTVRDHKJQFAX-UHFFFAOYSA-M
- CAS Registry Number: 100-56-1
- Chemical structure:
View 3d structure (requires JavaScript / HTML 5) - Other names: Agrenal; Agronal; Benzene, (chloromercurio)-; Chlorophenylmercury; Hexason; Merfazin; Mersolite 2; Phenyl chloromercury; Phenylmercuric chloride; Phenylmercury chloride; PMC; Phenylmercury(II) chloride; Benzene, (chloromercuri)-; Chlorid fenylrtutnaty; (Chloromercuri)benzene; Fenylmercurichlorid; Mercuriphenyl chloride; Phenylquecksilberchlorid; Stopspot; Mercutal; Monophenylmercury chloride; PMC (fungicide)

Condensed phase thermochemistry data

Data compiled by: José A. Martinho Simões
Quantity | Value | Units | Method | Reference | Comment |
---|---|---|---|---|---|
ΔfH°solid | 3.5 ± 6.2 | kJ/mol | Review | Martinho Simões | The enthalpy of formation relies on 281.4 ± 5.6 kJ/mol for the enthalpy of formation of Hg(Ph)2(l). |
ΔfH°solid | -3.5 ± 3.7 | kJ/mol | Review | Martinho Simões | The enthalpy of formation relies on 281.4 ± 5.6 kJ/mol for the enthalpy of formation of Hg(Ph)2(l). |
ΔfH°solid | 0.0 ± 3.5 | kJ/mol | Review | Martinho Simões |

Reaction thermochemistry data

Data compiled by: José A. Martinho Simões
Individual Reactions
(l) + Cl2Hg (cr) = 2
(cr)
By formula: C12H10Hg (l) + Cl2Hg (cr) = 2C6H5ClHg (cr)
Quantity | Value | Units | Method | Reference | Comment |
---|---|---|---|---|---|
ΔrH° | -58.2 ± 2.1 | kJ/mol | RSC | Chernick, Skinner, et al., 1956 | Please also see Pedley and Rylance, 1977 and Cox and Pilcher, 1970. |

Gas phase ion energetics data

Data compiled as indicated in comments:
LBLHLM - Sharon G. Lias, John E. Bartmess, Joel F. Liebman, John L. Holmes, Rhoda D. Levin, and W. Gary Mallard
LLK - Sharon G. Lias, Rhoda D. Levin, and Sherif A. Kafafi
Ionization energy determinations
IE (eV) | Method | Reference | Comment |
---|---|---|---|
9.10 | PE | Furlani, Piancastelli, et al., 1981 | LLK |
9.40 ± 0.05 | PE | Baidin, Timoshenko, et al., 1985 | Vertical value; LBLHLM |
9.46 | PE | Furlani, Piancastelli, et al., 1981 | Vertical value; LLK |

References

Martinho Simões
Martinho Simões, J.A.,
Private communication (see http://webbook.nist.gov/chemistry/om/). [all data]
Chernick, Skinner, et al., 1956
Chernick, C.L.; Skinner, H.A.; Wadsö, I.,
Trans. Faraday Soc., 1956, 52, 1088. [all data]
Pedley and Rylance, 1977
Pedley, J.B.; Rylance, J.,
Computer Analysed Thermochemical Data: Organic and Organometallic Compounds, University of Sussex, Brigton, 1977. [all data]
Cox and Pilcher, 1970
Cox, J.D.; Pilcher, G.,
Thermochemistry of Organic and Organometallic Compounds
in Academic Press, New York, 1970. [all data]
Furlani, Piancastelli, et al., 1981
Furlani, C.; Piancastelli, M.N.; Cauletti, C.; Faticanti, F.; Ortaggi, G.,
He(I) and He(II) photoelectron spectra of some organomercury compounds with carbon π-systems,
J. Electron Spectrosc. Relat. Phenom., 1981, 22, 309. [all data]
Baidin, Timoshenko, et al., 1985
Baidin, V.N.; Timoshenko, M.M.; Chizhov, Y.V.; Ustynyuk, Y.A.; Kritskaya, I.I.,
Photoelectron spectra nad the structure of organomercury compounds,
J. Organomet. Chem., 1985, 292, 55. [all data]