Bullvalene
- Formula: C10H10
- Molecular weight: 130.1864
- IUPAC Standard InChIKey: UKFBVTJTKMSPMI-UHFFFAOYSA-N
- CAS Registry Number: 1005-51-2
- Chemical structure:
View 3d structure (requires JavaScript / HTML 5) - Permanent link for this species. Use this link for bookmarking this species for future reference.

Gas phase thermochemistry data

Data compiled as indicated in comments:
ALS - Hussein Y. Afeefy, Joel F. Liebman, and Stephen E. Stein
GT - Glushko Thermocenter, Russian Academy of Sciences, Moscow
Quantity | Value | Units | Method | Reference | Comment |
---|---|---|---|---|---|
ΔfH°gas | 334.1 ± 3.3 | kJ/mol | Ccb | Mansson and Sunner, 1981 | ALS |
Quantity | Value | Units | Method | Reference | Comment |
S°gas | 337.1 ± 2.4 | J/mol*K | N/A | Falk B., 1980 | GT |
S°gas | 336.6 ± 1.0 | J/mol*K | N/A | Falk B., 1980 | GT |

Condensed phase thermochemistry data

Data compiled as indicated in comments:
ALS - Hussein Y. Afeefy, Joel F. Liebman, and Stephen E. Stein
DH - Eugene S. Domalski and Elizabeth D. Hearing
Quantity | Value | Units | Method | Reference | Comment |
---|---|---|---|---|---|
ΔfH°solid | 262.3 ± 3.3 | kJ/mol | Ccb | Mansson and Sunner, 1981 | ALS |
Quantity | Value | Units | Method | Reference | Comment |
ΔcH°solid | -5626.5 ± 3.0 | kJ/mol | Ccb | Mansson and Sunner, 1981 | Corresponding ΔfHºsolid = 262.28 kJ/mol (simple calculation by NIST; no Washburn corrections); ALS |
Quantity | Value | Units | Method | Reference | Comment |
S°solid,1 bar | 174.66 | J/mol*K | N/A | Falk B., 1980 | DH |
Constant pressure heat capacity of solid
Cp,solid (J/mol*K) | Temperature (K) | Reference | Comment |
---|---|---|---|
190.38 | 298.15 | Falk B., 1980 | T = 5 to 450 K.; DH |

Phase change data

Data compiled as indicated in comments:
TRC - Thermodynamics Research Center, NIST Boulder Laboratories, Chris Muzny director
ALS - Hussein Y. Afeefy, Joel F. Liebman, and Stephen E. Stein
DRB - Donald R. Burgess, Jr.
AC - William E. Acree, Jr., James S. Chickos
DH - Eugene S. Domalski and Elizabeth D. Hearing
Quantity | Value | Units | Method | Reference | Comment |
---|---|---|---|---|---|
Ttriple | 366.5 | K | N/A | Falk, 1980 | Uncertainty assigned by TRC = 0.1 K; TRC |
Quantity | Value | Units | Method | Reference | Comment |
ΔsubH° | 71.83 | kJ/mol | C | Mansson and Sunner, 1981 | ALS |
ΔsubH° | 71.8 | kJ/mol | N/A | Mansson and Sunner, 1981 | DRB |
ΔsubH° | 71.8 | kJ/mol | C | Mansson and Sunner, 1981 | AC |
Enthalpy of fusion
ΔfusH (kJ/mol) | Temperature (K) | Reference | Comment |
---|---|---|---|
15.250 | 366.5 | Falk B., 1980 | DH |
15.25 | 366.5 | Domalski and Hearing, 1996 | AC |
Entropy of fusion
ΔfusS (J/mol*K) | Temperature (K) | Reference | Comment |
---|---|---|---|
41.61 | 366.5 | Falk B., 1980 | DH |

Gas phase ion energetics data

Data compiled as indicated in comments:
RDSH - Henry M. Rosenstock, Keith Draxl, Bruce W. Steiner, and John T. Herron
Ionization energy determinations
IE (eV) | Method | Reference | Comment |
---|---|---|---|
8.13 | PE | Bodor, Dewar, et al., 1970 | RDSH |
8.05 | PE | Bischof, Gleiter, et al., 1970 | RDSH |

References

Mansson and Sunner, 1981
Mansson, M.; Sunner, S.,
Enthalpy of formation and strain energy of bullvalene (tricyclo[3.3.2.04,6]deca-2,7,9-triene); a calorimetric study,
J. Chem. Thermodyn., 1981, 13, 671-675. [all data]
Falk B., 1980
Falk B.,
Heat capacity and thermodynamic properties of tricyclo[3.3.2.0(4,6)]deca-2,7,9-triene (bullvalene) between 5 and 450 K,
J. Chem. Thermodyn., 1980, 12, 967-974. [all data]
Falk, 1980
Falk, B.,
Heat capacity and thermodynamic properties of tricyclo(3.3.2)deca-2,7,9- triene(bullvalene) between 5 and 450 k,
J. Chem. Thermodyn., 1980, 12, 967. [all data]
Domalski and Hearing, 1996
Domalski, Eugene S.; Hearing, Elizabeth D.,
Heat Capacities and Entropies of Organic Compounds in the Condensed Phase. Volume III,
J. Phys. Chem. Ref. Data, 1996, 25, 1, 1, https://doi.org/10.1063/1.555985
. [all data]
Bodor, Dewar, et al., 1970
Bodor, N.; Dewar, M.J.S.; Worley, S.D.,
Photoelectron spectra of molecules. III. Ionization potentials of some cyclic hydrocarbons and their derivatives, and heats of formation and ionization potentials calculated by the MINDO SCF MO method,
J. Am. Chem. Soc., 1970, 92, 19. [all data]
Bischof, Gleiter, et al., 1970
Bischof, P.; Gleiter, R.; Heilbronner, E.; Hornung, V.; Schroder, G.,
The conjugative interaction between π-orbitals and Walsh-e-orbitals in bullvalene and related systems,
Helv. Chim. Acta, 1970, 53, 1645. [all data]
Vagt and Crigee, 1966
Vagt, G.; Crigee, R.,
UV atlas of organic compounds, 1966, 1, A1/9. [all data]