Benzaldehyde
- Formula: C7H6O
- Molecular weight: 106.1219
- IUPAC Standard InChIKey: HUMNYLRZRPPJDN-UHFFFAOYSA-N
- CAS Registry Number: 100-52-7
- Chemical structure:
View 3d structure (requires JavaScript / HTML 5) - Other names: Artificial Almond Oil; Benzaldehyde FFC; Benzenecarbonal; Benzenecarboxaldehyde; Benzoic aldehyde; Phenylmethanal; Almond artificial essential oil; Phenylmethanal benzenecarboxaldehyde; NCI-C56133; Oil of Bitter Almond; Artificial essential oil of almond; Benzene carbaldehyde; NA 1989; Artifical essential oil of almond; Artificial bitter almond oil; Benzenemethylal; Benzoyl hydride; Ethereal oil of bitter almonds; Benzylaldehyde; NSC 7917; Benzyaldehyde

Gas phase thermochemistry data

Data compiled as indicated in comments:
ALS - Hussein Y. Afeefy, Joel F. Liebman, and Stephen E. Stein
DRB - Donald R. Burgess, Jr.
GT - Glushko Thermocenter, Russian Academy of Sciences, Moscow
Quantity | Value | Units | Method | Reference | Comment |
---|---|---|---|---|---|
ΔfH°gas | -8.80 ± 0.72 | kcal/mol | Ccb | Ambrose, Connett, et al., 1975 | ALS |
ΔfH°gas | -7.950 | kcal/mol | Cm | Kudchadker and Kudchadker, 1975 | ALS |
ΔfH°gas | -8.90 ± 0.22 | kcal/mol | Ccb | Lebedeva and Katin, 1972 | Reanalyzed by Pedley, Naylor, et al., 1986, Original value = -8.0 ± 0.4 kcal/mol; ALS |
ΔfH°gas | -8.9 ± 1.0 | kcal/mol | Eqk | Solly and Benson, 1971 | ALS |
ΔfH°gas | -9.66 | kcal/mol | N/A | Landrieu, Baylocq, et al., 1929 | Value computed using ΔfHliquid° value of -86.2 kj/mol from Landrieu, Baylocq, et al., 1929 and ΔvapH° value of 45.9 kj/mol from Lebedeva and Katin, 1972.; DRB |
Constant pressure heat capacity of gas
Cp,gas (cal/mol*K) | Temperature (K) | Reference | Comment |
---|---|---|---|
24.57 | 273.15 | Ambrose D., 1975 | Selected entropy values agree with the observed ones within experimental error. Entropies obtained from other statistical calculations [ Sarin V.N., 1973, Kudchadker S.A., 1975] differ substantially from experimental values.; GT |
26.70 | 298.15 | ||
26.84 | 300. | ||
35.01 | 400. | ||
41.92 | 500. | ||
47.47 | 600. | ||
51.91 | 700. | ||
55.50 | 800. | ||
58.46 | 900. | ||
60.95 | 1000. | ||
63.00 | 1100. | ||
64.77 | 1200. | ||
66.28 | 1300. | ||
67.57 | 1400. | ||
68.67 | 1500. |

Condensed phase thermochemistry data

Data compiled as indicated in comments:
ALS - Hussein Y. Afeefy, Joel F. Liebman, and Stephen E. Stein
DH - Eugene S. Domalski and Elizabeth D. Hearing
Quantity | Value | Units | Method | Reference | Comment |
---|---|---|---|---|---|
ΔfH°liquid | -20.8 ± 0.53 | kcal/mol | Ccb | Ambrose, Connett, et al., 1975 | ALS |
ΔfH°liquid | -19.85 ± 0.20 | kcal/mol | Ccb | Lebedeva and Katin, 1972 | ALS |
ΔfH°liquid | -20.6 | kcal/mol | Ccb | Landrieu, Baylocq, et al., 1929 | ALS |
Quantity | Value | Units | Method | Reference | Comment |
ΔcH°liquid | -842.50 ± 0.48 | kcal/mol | Ccb | Ambrose, Connett, et al., 1975 | Corresponding ΔfHºliquid = -20.8 kcal/mol (simple calculation by NIST; no Washburn corrections); ALS |
ΔcH°liquid | -843.4 ± 0.2 | kcal/mol | Ccb | Lebedeva and Katin, 1972 | Corresponding ΔfHºliquid = -19.9 kcal/mol (simple calculation by NIST; no Washburn corrections); ALS |
ΔcH°liquid | -842.7 | kcal/mol | Ccb | Landrieu, Baylocq, et al., 1929 | Corresponding ΔfHºliquid = -20.6 kcal/mol (simple calculation by NIST; no Washburn corrections); ALS |
Quantity | Value | Units | Method | Reference | Comment |
S°liquid | 52.87 | cal/mol*K | N/A | Ambrose, Connett, et al., 1975 | DH |
Constant pressure heat capacity of liquid
Cp,liquid (cal/mol*K) | Temperature (K) | Reference | Comment |
---|---|---|---|
41.11 | 298.15 | Ambrose, Connett, et al., 1975 | T = 13 to 425 K.; DH |
40.89 | 302.4 | de Kolossowsky and Udowenko, 1934 | DH |
40.89 | 302.3 | Kolosovskii and Udovenko, 1934 | DH |

Phase change data

Data compiled as indicated in comments:
BS - Robert L. Brown and Stephen E. Stein
TRC - Thermodynamics Research Center, NIST Boulder Laboratories, Chris Muzny director
AC - William E. Acree, Jr., James S. Chickos
DRB - Donald R. Burgess, Jr.
ALS - Hussein Y. Afeefy, Joel F. Liebman, and Stephen E. Stein
DH - Eugene S. Domalski and Elizabeth D. Hearing
Quantity | Value | Units | Method | Reference | Comment |
---|---|---|---|---|---|
Tboil | 452. ± 7. | K | AVG | N/A | Average of 13 values; Individual data points |
Quantity | Value | Units | Method | Reference | Comment |
Tfus | 247. | K | N/A | Buckingham and Donaghy, 1982 | BS |
Tfus | 216.65 | K | N/A | Biltz, Fischer, et al., 1930 | Uncertainty assigned by TRC = 0.5 K; TRC |
Tfus | 217.55 | K | N/A | Timmermans, 1921 | Uncertainty assigned by TRC = 0.5 K; TRC |
Tfus | 216.25 | K | N/A | Timmermans, 1921 | Uncertainty assigned by TRC = 0.6 K; TRC |
Tfus | 259.7 | K | N/A | Altschul and Von Schneider, 1895 | Uncertainty assigned by TRC = 0.5 K; TRC |
Quantity | Value | Units | Method | Reference | Comment |
Ttriple | 216.02 | K | N/A | Ambrose, Connett, et al., 1975, 2 | Uncertainty assigned by TRC = 0.02 K; TRC |
Quantity | Value | Units | Method | Reference | Comment |
Tc | 690. | K | N/A | Anselme and Teja, 1990 | Uncertainty assigned by TRC = 20. K; Tc > 690 K, which was observed with decomposition; TRC |
Tc | 695. | K | N/A | Ambrose, Connett, et al., 1975, 2 | Uncertainty assigned by TRC = 5. K; Visual, Decomp, VPX; TRC |
Tc | 625.15 | K | N/A | Glaser and Ruland, 1957 | Uncertainty assigned by TRC = 3. K; TRC |
Quantity | Value | Units | Method | Reference | Comment |
Pc | 45.89 | atm | N/A | Ambrose, Connett, et al., 1975, 2 | Uncertainty assigned by TRC = 0.4585 atm; Visual, Decomp, VPX; TRC |
Pc | 21.5000 | atm | N/A | Glaser and Ruland, 1957 | Uncertainty assigned by TRC = 3.0000 atm; TRC |
Quantity | Value | Units | Method | Reference | Comment |
ΔvapH° | 11. ± 1. | kcal/mol | AVG | N/A | Average of 7 values; Individual data points |
Reduced pressure boiling point
Tboil (K) | Pressure (atm) | Reference | Comment |
---|---|---|---|
335.2 | 0.013 | Weast and Grasselli, 1989 | BS |
452. | 0.988 | Buckingham and Donaghy, 1982 | BS |
335. | 0.013 | Buckingham and Donaghy, 1982 | BS |
Enthalpy of vaporization
ΔvapH (kcal/mol) | Temperature (K) | Method | Reference | Comment |
---|---|---|---|---|
11.8 | 363. | A | Stephenson and Malanowski, 1987 | Based on data from 348. to 452. K.; AC |
10.5 | 424. | A | Stephenson and Malanowski, 1987 | Based on data from 409. to 481. K.; AC |
11.6 | 326. | A | Stephenson and Malanowski, 1987 | Based on data from 311. to 376. K.; AC |
10.9 | 385. | A | Stephenson and Malanowski, 1987 | Based on data from 370. to 475. K.; AC |
10.0 | 480. | A | Stephenson and Malanowski, 1987 | Based on data from 465. to 541. K.; AC |
9.70 | 544. | A | Stephenson and Malanowski, 1987 | Based on data from 529. to 599. K.; AC |
11.2 | 288. | A,BG | Stephenson and Malanowski, 1987 | Based on data from 273. to 373. K. See also De Maré, Lehman, et al., 1973.; AC |
12.0 | 311. | V | Ambrose, Connett, et al., 1975 | ALS |
10.2 | 452. | EB | Ambrose, Connett, et al., 1975 | Based on data from 311. to 404. K.; AC |
13.0 | 314. | N/A | Stull, 1947 | Based on data from 299. to 452. K.; AC |
Antoine Equation Parameters
log10(P) = A − (B / (T + C))
P = vapor pressure (atm)
T = temperature (K)
View plot Requires a JavaScript / HTML 5 canvas capable browser.
Temperature (K) | A | B | C | Reference | Comment |
---|---|---|---|---|---|
273.14 to 322.06 | 5.20925 | 2337.539 | -5.103 | De Maré, Lehman, et al., 1973 | Coefficents calculated by NIST from author's data. |
299.4 to 452. | 3.87081 | 1380.729 | -94.98 | Stull, 1947 | Coefficents calculated by NIST from author's data. |
Enthalpy of fusion
ΔfusH (kcal/mol) | Temperature (K) | Reference | Comment |
---|---|---|---|
2.228 | 216.02 | Ambrose, Connett, et al., 1975 | DH |
2.23 | 216. | Domalski and Hearing, 1996 | AC |
Entropy of fusion
ΔfusS (cal/mol*K) | Temperature (K) | Reference | Comment |
---|---|---|---|
10.31 | 216.02 | Ambrose, Connett, et al., 1975 | DH |

Reaction thermochemistry data

Data compiled as indicated in comments:
M - Michael M. Meot-Ner (Mautner) and Sharon G. Lias
ALS - Hussein Y. Afeefy, Joel F. Liebman, and Stephen E. Stein
Individual Reactions
By formula: Br- + C7H6O = (Br- • C7H6O)
Quantity | Value | Units | Method | Reference | Comment |
---|---|---|---|---|---|
ΔrH° | 13.2 | kcal/mol | PHPMS | Paul and Kebarle, 1991 | gas phase; Entropy change calculated or estimated; M |
Quantity | Value | Units | Method | Reference | Comment |
ΔrS° | 20. | cal/mol*K | N/A | Paul and Kebarle, 1991 | gas phase; Entropy change calculated or estimated; M |
Free energy of reaction
ΔrG° (kcal/mol) | T (K) | Method | Reference | Comment |
---|---|---|---|---|
4.7 | 423. | PHPMS | Paul and Kebarle, 1991 | gas phase; Entropy change calculated or estimated; M |
By formula: NO- + C7H6O = (NO- • C7H6O)
Quantity | Value | Units | Method | Reference | Comment |
---|---|---|---|---|---|
ΔrH° | 43.7 | kcal/mol | ICR | Reents and Freiser, 1981 | gas phase; switching reaction,Thermochemical ladder(NO+)C2H5OH, Entropy change calculated or estimated; Farid and McMahon, 1978; M |
By formula: C7H6O + C7H6O3 = 2C7H6O2
Quantity | Value | Units | Method | Reference | Comment |
---|---|---|---|---|---|
ΔrH° | -75.6 ± 3.0 | kcal/mol | Cm | Briner and Chastonay, 1954 | liquid phase; Reanalyzed by Cox and Pilcher, 1970, Original value = -75.7 ± 3.0 kcal/mol; ALS |
By formula: C7H6O + C8H8O = H2O + C15H12O
Quantity | Value | Units | Method | Reference | Comment |
---|---|---|---|---|---|
ΔrH° | -15.54 ± 0.45 | kcal/mol | Cm | Hao, Chang, et al., 1985 | liquid phase; solvent: Aqueous NaOH; ALS |
By formula: HI + C7H5IO = C7H6O + I2
Quantity | Value | Units | Method | Reference | Comment |
---|---|---|---|---|---|
ΔrH° | -3.0 ± 1.0 | kcal/mol | Eqk | Solly and Benson, 1971 | gas phase; ALS |
By formula: C7H6O + I2 = HI + C7H5IO
Quantity | Value | Units | Method | Reference | Comment |
---|---|---|---|---|---|
ΔrH° | 3.0 ± 1.0 | kcal/mol | Eqk | Solly and Benson, 1971 | gas phase; ALS |
By formula: C13H12N2 + H2O = C7H6O + C6H8N2
Quantity | Value | Units | Method | Reference | Comment |
---|---|---|---|---|---|
ΔrH° | -14.6 | kcal/mol | Cm | Landrieu, 1905 | solid phase; ALS |
By formula: C7H8O = C7H6O + H2
Quantity | Value | Units | Method | Reference | Comment |
---|---|---|---|---|---|
ΔrH° | 12.89 | kcal/mol | Eqk | Cubberley and Mueller, 1946 | gas phase; ALS |
By formula: C7H6O3 = C7H6O + O2
Quantity | Value | Units | Method | Reference | Comment |
---|---|---|---|---|---|
ΔrH° | 60.5 | kcal/mol | Cm | Briner and Chastonay, 1954 | solid phase; ALS |

Henry's Law data

Data compiled by: Rolf Sander
Henry's Law constant (water solution)
kH(T) = k°H exp(d(ln(kH))/d(1/T) ((1/T) - 1/(298.15 K)))
k°H = Henry's law constant for solubility in water at 298.15 K (mol/(kg*bar))
d(ln(kH))/d(1/T) = Temperature dependence constant (K)
k°H (mol/(kg*bar)) | d(ln(kH))/d(1/T) (K) | Method | Reference | Comment |
---|---|---|---|---|
39. | 4800. | L | N/A | |
42. | 4600. | M | N/A | The data from Table 1 by missing citation was used to redo the regression analysis. The data for acetone in their Table 2 is wrong. |
37. | 5100. | M | N/A | missing citation list effective values that take into account hydration of the aldehydes: kH = ([RCHO] + [RCH(OH)2]) / p(RCHO) |
36. | X | N/A | Value given here as quoted by missing citation. | |
36. | V | N/A |

Gas phase ion energetics data

Data evaluated as indicated in comments:
HL - Edward P. Hunter and Sharon G. Lias
L - Sharon G. Lias
Data compiled as indicated in comments:
MM - Michael M. Meot-Ner (Mautner)
LBLHLM - Sharon G. Lias, John E. Bartmess, Joel F. Liebman, John L. Holmes, Rhoda D. Levin, and W. Gary Mallard
LLK - Sharon G. Lias, Rhoda D. Levin, and Sherif A. Kafafi
RDSH - Henry M. Rosenstock, Keith Draxl, Bruce W. Steiner, and John T. Herron
B - John E. Bartmess
Quantity | Value | Units | Method | Reference | Comment |
---|---|---|---|---|---|
IE (evaluated) | 9.50 ± 0.08 | eV | N/A | N/A | L |
Quantity | Value | Units | Method | Reference | Comment |
Proton affinity (review) | 199.3 | kcal/mol | N/A | Hunter and Lias, 1998 | HL |
Quantity | Value | Units | Method | Reference | Comment |
Gas basicity | 191.7 | kcal/mol | N/A | Hunter and Lias, 1998 | HL |
Electron affinity determinations
EA (eV) | Method | Reference | Comment |
---|---|---|---|
0.4293 ± 0.0087 | ECD | Wentworth, Kao, et al., 1975 | B |
0.421 ± 0.010 | ECD | Wentworth and Chen, 1967 | B |
0.390 ± 0.050 | ECD | Zlatkis, Lee, et al., 1983 | B |
Proton affinity at 298K
Proton affinity (kcal/mol) | Reference | Comment |
---|---|---|
198.8 ± 0.31 | Fernandez, Jennings, et al., 1989 | T = 573 - 725K; Reference Sprot(C2H5)2O = 17.0 J/mol K in Hunter and Lias, 1998 needs to be re-evaluated. Using Sprot(C6H5CHO) = 2 J/mol K from Hunter and Lias, 1998, this measurement yields Sprot((C2H5)2O = 8 J/mol K.; MM |
Gas basicity at 298K
Gas basicity (review) (kcal/mol) | Reference | Comment |
---|---|---|
191.8 ± 0.81 | Fernandez, Jennings, et al., 1989 | T = 573 - 725K; Reference Sprot(C2H5)2O = 17.0 J/mol K in Hunter and Lias, 1998 needs to be re-evaluated. Using Sprot(C6H5CHO) = 2 J/mol K from Hunter and Lias, 1998, this measurement yields Sprot((C2H5)2O = 8 J/mol K.; MM |
Protonation entropy at 298K
Protonation entropy (cal/mol*K) | Reference | Comment |
---|---|---|
2.6 | Fernandez, Jennings, et al., 1989 | T = 573 - 725K; Reference Sprot(C2H5)2O = 17.0 J/mol K in Hunter and Lias, 1998 needs to be re-evaluated. Using Sprot(C6H5CHO) = 2 J/mol K from Hunter and Lias, 1998, this measurement yields Sprot((C2H5)2O = 8 J/mol K.; MM |
Ionization energy determinations
IE (eV) | Method | Reference | Comment |
---|---|---|---|
~9.35 | PE | Klasinc, Kovac, et al., 1983 | LBLHLM |
9.49 | PI | McLoughlin and Traeger, 1979 | LLK |
9.65 | EI | Elder, Beynon, et al., 1976 | LLK |
9.49 | PE | Behan, Johnstone, et al., 1976 | LLK |
9.40 | PE | Rabalais and Colton, 1973 | LLK |
9.74 | EI | Benoit, 1973 | LLK |
9.50 ± 0.02 | PI | Iskakov and Potapov, 1971 | LLK |
9.53 ± 0.03 | EI | Bock, Alt, et al., 1969 | RDSH |
9.53 ± 0.03 | PI | Watanabe, Nakayama, et al., 1962 | RDSH |
9.6 | PI | Terenin, 1961 | RDSH |
9.51 ± 0.02 | PI | Watanabe, 1957 | RDSH |
9.60 ± 0.02 | PI | Vilesov and Terenin, 1957 | RDSH |
9.71 | PE | Gal, Geribaldi, et al., 1985 | Vertical value; LBLHLM |
9.57 | PE | Klasinc, Kovac, et al., 1983 | Vertical value; LBLHLM |
9.54 | PE | Benoit and Harrison, 1977 | Vertical value; LLK |
10.0 | PE | Rao, 1975 | Vertical value; LLK |
9.80 | PE | Baker, May, et al., 1968 | Vertical value; RDSH |
Appearance energy determinations
Ion | AE (eV) | Other Products | Method | Reference | Comment |
---|---|---|---|---|---|
CHO+ | 13.67 ± 0.13 | ? | EI | Reed and Thornley, 1958 | RDSH |
C6H5+ | 14.11 | CO+H | EI | Benoit, 1973 | LLK |
C6H5+ | 13.51 ± 0.12 | CHO? | EI | Reed and Thornley, 1958 | RDSH |
C7H5O+ | 9.93 | H | PI | McLoughlin and Traeger, 1979 | LLK |
C7H5O+ | 11.11 | H | EI | Elder, Beynon, et al., 1976 | LLK |
C7H5O+ | 11.26 | H | EI | Benoit, 1973 | LLK |
C7H5O+ | 10.99 | H | EI | Howe and Williams, 1969 | RDSH |

Ion clustering data

Data compiled by: Michael M. Meot-Ner (Mautner) and Sharon G. Lias
Clustering reactions
By formula: Br- + C7H6O = (Br- • C7H6O)
Quantity | Value | Units | Method | Reference | Comment |
---|---|---|---|---|---|
ΔrH° | 13.2 | kcal/mol | PHPMS | Paul and Kebarle, 1991 | gas phase; Entropy change calculated or estimated |
Quantity | Value | Units | Method | Reference | Comment |
ΔrS° | 20. | cal/mol*K | N/A | Paul and Kebarle, 1991 | gas phase; Entropy change calculated or estimated |
Free energy of reaction
ΔrG° (kcal/mol) | T (K) | Method | Reference | Comment |
---|---|---|---|---|
4.7 | 423. | PHPMS | Paul and Kebarle, 1991 | gas phase; Entropy change calculated or estimated |
By formula: NO- + C7H6O = (NO- • C7H6O)
Quantity | Value | Units | Method | Reference | Comment |
---|---|---|---|---|---|
ΔrH° | 43.7 | kcal/mol | ICR | Reents and Freiser, 1981 | gas phase; switching reaction,Thermochemical ladder(NO+)C2H5OH, Entropy change calculated or estimated; Farid and McMahon, 1978 |

Normal alkane RI, polar column, temperature ramp

Data compiled by: NIST Mass Spectrometry Data Center, William E. Wallace, director

Column type CapillaryCapillaryCapillaryCapillaryCapillary
Active phase HP-FFAPHP-FFAPHP-InnowaxFFAPHP-Innowax
Column length (m) 25.25.15.30.60.
Carrier gas HeliumHeliumHeliumNitrogenHelium
Substrate
Column diameter (mm) 0.320.320.320.320.25
Phase thickness (μm) 0.500.500.500.500.25
Tstart (C) 45.45.40.35.60.
Tend (C) 220.220.250.250.220.
Heat rate (K/min) 15.15.3.4.3.
Initial hold (min)    5.1.
Final hold (min)    45.5.
I 1553.1553.1521.1564.1538.
ReferenceWanakhachornkrai and Lertsiri, 9999Wanakhachornkrai and Lertsiri, 9999Puvipirom and Chaisei, 2012Budryn, Nebesny, et al., 2011Feng, Zhuang, et al., 2011
Comment MSDC-RI MSDC-RI MSDC-RI MSDC-RI MSDC-RI
Column type CapillaryCapillaryCapillaryCapillaryCapillary
Active phase AT-WaxFFAPTC-WaxCP Wax 52 CBDB-Wax
Column length (m) 60.60.60.30.30.
Carrier gas HeliumHeliumHeliumHeliumHelium
Substrate
Column diameter (mm) 0.250.250.250.320.32
Phase thickness (μm) 0.250.25 0.500.25
Tstart (C) 60.45.40.40.40.
Tend (C) 280.220.230.230.230.
Heat rate (K/min) 4.5.3.4.6.
Initial hold (min)  1.3.2.2.
Final hold (min)  5. 15.20.
I 1516.1514.1532.1527.1501.
ReferenceKiss, Csoka, et al., 2011Piyachaiseth, Jirapakkul, et al., 2011Miyazawa, Fujita, et al., 2010Birtic, Ginies, et al., 2009Chen, Song, et al., 2009
Comment MSDC-RI MSDC-RI MSDC-RI MSDC-RI MSDC-RI
Column type CapillaryCapillaryCapillaryCapillaryCapillary
Active phase DB-WaxSupelcowaxCP-WaxDB-WaxDB-Wax
Column length (m) 30.60.60.30.60.
Carrier gas HeliumNitrogenHeliumHeliumHelium
Substrate
Column diameter (mm) 0.320.350.250.250.32
Phase thickness (μm) 0.250.250.250.250.25
Tstart (C) 40.60.50.40.30.
Tend (C) 230.230.230.230.200.
Heat rate (K/min) 6.4.6.3.2.
Initial hold (min) 2. 2.2.4.
Final hold (min) 20.40.15.5.30.
I 1509.1536.1533.1519.1505.
ReferenceChen, Song, et al., 2009Gauvin-Bialecki and Marodon, 2009Mo, Fan, et al., 2009Zhao, Xu, et al., 2009Beck, Higbee, et al., 2008
Comment MSDC-RI MSDC-RI MSDC-RI MSDC-RI MSDC-RI
Column type CapillaryCapillaryCapillaryCapillaryCapillary
Active phase DB-WaxCP-Wax 57 CBHP-FFAPHP-InnowaxCP Wax 52 CB
Column length (m) 60.50.30.50.60.
Carrier gas HeliumHydrogenHeliumHeliumHelium
Substrate
Column diameter (mm) 0.320.250.250.200.25
Phase thickness (μm) 0.250.200.250.200.25
Tstart (C) 30.35.40.45.40.
Tend (C) 200.150.120.190.220.
Heat rate (K/min) 2.4.3.4.3.
Initial hold (min) 4.5.3.2.
Final hold (min) 30.17.55.50.
I 1516.1518.1525.1540.1484.
ReferenceBeck, Higbee, et al., 2008Callejon, Morales, et al., 2008Guzman-Geronimo, Lopez, et al., 2008Soria, Sanz, et al., 2008Chen, Chyau, et al., 2007
Comment MSDC-RI MSDC-RI MSDC-RI MSDC-RI MSDC-RI
Column type CapillaryCapillaryCapillaryCapillaryCapillary
Active phase StabilwaxDB-WaxHP-InnowaxFFAPCP-Wax 52CB
Column length (m) 60.30.30.30.60.
Carrier gas HeliumHeHeliumN2He
Substrate
Column diameter (mm) 0.250.320.250.320.32
Phase thickness (μm) 0.250.50.250.50.5
Tstart (C) 40.40.40.35.40.
Tend (C) 240.240.250.320.220.
Heat rate (K/min) 3.5.2.4.4.
Initial hold (min) 5. 5.5.8.
Final hold (min) 10.  45.20.
I 1524.1532.1543.1546.1537.
ReferenceCros, Vandanjon, et al., 2007Dury-Brun, Fournier, et al., 2007Formisano, Rigano, et al., 2007Nebesny, Budryn, et al., 2007Povolo, Contarini, et al., 2007
Comment MSDC-RI MSDC-RI MSDC-RI MSDC-RI MSDC-RI
Column type CapillaryCapillaryCapillaryCapillaryCapillary
Active phase BP-20Supelcowax-10DB-WaxHP-20MDB-Wax Etr
Column length (m) 30.30.30.50.60.
Carrier gas HeHeHeHeHe
Substrate
Column diameter (mm) 0.250.250.320.20.25
Phase thickness (μm) 0.250.250.250.10.25
Tstart (C) 70.40.40.60.40.
Tend (C) 220.250.230.220.230.
Heat rate (K/min) 4.3.4.2.2.
Initial hold (min) 4.5.2. 5.
Final hold (min) 5.10.15.30.100.
I 1528.1516.1501.1471.1520.
ReferenceRawat, Gulati, et al., 2007Vichi, Riu-Aumatell, et al., 2007Fan and Qian, 2006Filippi, Lanfranchi, et al., 2006Ibarz, Ferreira, et al., 2006
Comment MSDC-RI MSDC-RI MSDC-RI MSDC-RI MSDC-RI
Column type CapillaryCapillaryCapillaryCapillaryCapillary
Active phase HP-20MDB-Wax EtrDB-WaxDB-WaxInnowax
Column length (m) 50.30.30.30.50.
Carrier gas HeHe  He
Substrate
Column diameter (mm) 0.20.250.250.250.2
Phase thickness (μm) 0.20.250.250.250.5
Tstart (C) 70.40.40.40.60.
Tend (C) 180.220.200.200.250.
Heat rate (K/min) 4.2.8.8.2.
Initial hold (min) 4.1.3.3.
Final hold (min) 15.10.20.20.60.
I 1479.1549.1500.1500.1518.
ReferenceMastelic, Jerkovic, et al., 2006Perestrelo, Fernandes, et al., 2006Schirack, Drake, et al., 2006Schirack, Drake, et al., 2006Bendimerad and Bendiab, 2005
Comment MSDC-RI MSDC-RI MSDC-RI MSDC-RI MSDC-RI
Column type CapillaryCapillaryCapillaryCapillaryCapillary
Active phase Carbowax 20MStabilwaxInnowaxDB-WaxCP-Wax 52CB
Column length (m) 50.30.60.30.30.
Carrier gas Helium HeHeHe
Substrate
Column diameter (mm) 0.250.320.250.250.32
Phase thickness (μm) 0.250.50.250.250.25
Tstart (C) 40.40.60.50.40.
Tend (C) 190.280.240.180.220.
Heat rate (K/min) 4.6.5.3.4.
Initial hold (min) 2.5.  1.
Final hold (min) 30.5.30.40.
I 1524.1499.1532.1508.1511.
Referencede la Fuente, Martinez-Castro, et al., 2005Jirovetz, Buchbauer, et al., 2005Joichi, Yomogida, et al., 2005Lee, Umano, et al., 2005Rohloff and Bones, 2005
Comment MSDC-RI MSDC-RI MSDC-RI MSDC-RI MSDC-RI
Column type CapillaryCapillaryCapillaryCapillaryCapillary
Active phase Supelcowax-10Supelcowax-10ZB-WaxZB-WaxZB-Wax
Column length (m) 30.30.30.30.30.
Carrier gas  HeHeliumHeliumHelium
Substrate
Column diameter (mm) 0.250.250.320.320.32
Phase thickness (μm) 0.250.250.250.250.25
Tstart (C) 40.50.40.40.40.
Tend (C) 220.220.250.250.250.
Heat rate (K/min) 3.4.5.5.5.
Initial hold (min) 5.3.2.2.2.
Final hold (min) 10.30.5.5.5.
I 1516.1522.1491.1494.1496.
ReferenceVichi, Riu-Aumatell, et al., 2005Wong and Tan, 2005N/AN/AN/A
Comment MSDC-RI MSDC-RI MSDC-RI MSDC-RI MSDC-RI
Column type CapillaryCapillaryCapillaryCapillaryCapillary
Active phase ZB-WaxZB-WaxPEG-20MDB-WaxDB-Wax
Column length (m) 30.30.30.60.60.
Carrier gas HeliumHe  N2
Substrate
Column diameter (mm) 0.320.320.250.250.25
Phase thickness (μm) 0.250.25 0.50.25
Tstart (C) 40.40.60.35.70.
Tend (C) 250.250.180.240.230.
Heat rate (K/min) 5.5.3.4.2.
Initial hold (min) 2.2.10.5.2.
Final hold (min) 5.10.30.10.20.
I 1506.1491.1529.1497.1519.
ReferenceN/AWu, Krings, et al., 2005Yao, Guo, et al., 2005Chida, Sone, et al., 2004Choi, 2004
Comment MSDC-RI MSDC-RI MSDC-RI MSDC-RI MSDC-RI
Column type CapillaryCapillaryCapillaryCapillaryCapillary
Active phase DB-WaxPEG-20MPEG-20MDB-WaxHP-Innowax
Column length (m) 60.50.50.60.50.
Carrier gas He  HeHe
Substrate
Column diameter (mm) 0.250.200.200.320.2
Phase thickness (μm) 0.250.200.200.250.2
Tstart (C) 40.40.40.35.45.
Tend (C) 220.180.180.220.190.
Heat rate (K/min) 3.3.3.3.4.
Initial hold (min) 5.5.5. 2.
Final hold (min)  30.30. 50.
I 1550.1527.1527.1520.1545.
ReferenceLópez, Ezpeleta, et al., 2004Narain, Almeida, et al., 2004Narain, Almeida, et al., 2004Palá-Paúl, Brophy, et al., 2004Soria, Gonzalez, et al., 2004
Comment MSDC-RI MSDC-RI MSDC-RI MSDC-RI MSDC-RI
Column type CapillaryCapillaryCapillaryCapillaryCapillary
Active phase Carbowax 20MDB-WaxStabilwaxDB-WaxTC-Wax
Column length (m) 25.30.60.30.60.
Carrier gas N2H2HeliumHeHe
Substrate
Column diameter (mm) 0.220.250.250.250.25
Phase thickness (μm) 0.250.50.250.25
Tstart (C) 50.50.40.50.80.
Tend (C) 200.200.240.230.250.
Heat rate (K/min) 5.3.3.3.4.
Initial hold (min)  10.5.2.
Final hold (min)  10.10.20.30.
I 1523.1533.1524.1513.1530.
ReferenceAgnaniet, Mounzeo, et al., 2003Alves and Franco, 2003Cros, Vandanjon, et al., 2003Lin, Cai, et al., 2003Miyazawa and Okuno, 2003
Comment MSDC-RI MSDC-RI MSDC-RI MSDC-RI MSDC-RI
Column type CapillaryCapillaryCapillaryCapillaryCapillary
Active phase TC-WaxCarbowax 20MHP-InnowaxCarbowax 20MDB-Wax
Column length (m) 60.50.50.50.30.
Carrier gas  HeliumHeHe
Substrate
Column diameter (mm) 0.250.700.20.250.25
Phase thickness (μm)   0.20.250.25
Tstart (C) 80.50.45.45.30.
Tend (C) 240.280.190.190.250.
Heat rate (K/min) 3.4.4.4.4.
Initial hold (min)  2.2.2.1.
Final hold (min)   50.50.
I 1536.1494.1539.1539.1518.
ReferenceMiyazawa, Yamafuji, et al., 2003Saura, LAencina, et al., 2003Soria, Martinez-Castro, et al., 2003Soria, Martinez-Castro, et al., 2003Tanaka, Yamauchi, et al., 2003
Comment MSDC-RI MSDC-RI MSDC-RI MSDC-RI MSDC-RI
Column type CapillaryCapillaryCapillaryCapillaryCapillary
Active phase DB-WaxSupelcowax-10HP-FFAPHP-FFAPDB-Wax
Column length (m) 30.30.25.25.30.
Carrier gas  HeHeHeHe
Substrate
Column diameter (mm) 0.250.250.320.320.25
Phase thickness (μm) 0.250.250.50.50.25
Tstart (C) 30.40.45.45.40.
Tend (C) 250.200.220.220.250.
Heat rate (K/min) 4.3.15.15.8.
Initial hold (min) 1.10.  5.
Final hold (min)     5.
I 1519.1512.1553.1553.1503.
ReferenceTanaka, Yamauchi, et al., 2003Vichi, Pizzale, et al., 2003Wanakhachornkrai and Lertsiri, 2003Wanakhachornkrai and Lertsiri, 2003Fu, Yoon, et al., 2002
Comment MSDC-RI MSDC-RI MSDC-RI MSDC-RI MSDC-RI
Column type CapillaryCapillaryCapillaryCapillaryCapillary
Active phase DB-WaxHP-WaxFFAPDB-WaxCarbowax 20M
Column length (m) 60.60.30.30.60.
Carrier gas HeHeH2HeliumHe
Substrate
Column diameter (mm) 0.250.250.320.250.32
Phase thickness (μm) 0.250.50.250.250.5
Tstart (C) 40.40.40.25.40.
Tend (C) 220.190.240.220.190.
Heat rate (K/min) 3.3.3.4.2.
Initial hold (min) 10.6.5. 5.
Final hold (min) 10.  30.
I 1509.1561.1510.1506.1539.
ReferenceHayata, Sakamoto, et al., 2002Sanz, Maeztu, et al., 2002Ducruet, Fournier, et al., 2001Duque, Bonilla, et al., 2001Escudero, Cacho, et al., 2000
Comment MSDC-RI MSDC-RI MSDC-RI MSDC-RI MSDC-RI
Column type CapillaryCapillaryCapillaryCapillaryCapillary
Active phase Supelcowax-10Supelcowax-10Supelcowax-10DB-WaxDB-Wax
Column length (m) 60.30.60.30.60.
Carrier gas HeHeHeHeHelium
Substrate
Column diameter (mm) 0.250.320.250.250.32
Phase thickness (μm) 0.250.250.250.250.25
Tstart (C) 35.70.60.50.50.
Tend (C) 200.240.280.180.230.
Heat rate (K/min) 4.5.4.3.5.
Initial hold (min) 10.8.  2.
Final hold (min)  20. 40.
I 1538.1507.1537.1510.1519.
ReferenceGirard and Durance, 2000Kim, Kim, et al., 2000Korány, Mednyánszky, et al., 2000Lee and Shibamoto, 2000Paniandy, Chane-Ming, et al., 2000
Comment MSDC-RI MSDC-RI MSDC-RI MSDC-RI MSDC-RI
Column type CapillaryCapillaryCapillaryCapillaryCapillary
Active phase DB-WaxCarbowax 20MDB-WaxPEG-20MCP-Wax 52CB
Column length (m) 60.25.60.60.50.
Carrier gas HeHe N2H2
Substrate
Column diameter (mm) 0.250.30.320.250.32
Phase thickness (μm) 0.25   0.22
Tstart (C) 40.60.30.70.60.
Tend (C) 200.190.170.220.190.
Heat rate (K/min) 2.5.2.3.2.
Initial hold (min) 2.2.4. 4.
Final hold (min)  20.60. 21.
I 1514.1483.1516.1550.1502.
ReferenceUmano, Hagi, et al., 2000Xue, Ye, et al., 2000Buttery, Orts, et al., 1999Hirose, Joichi, et al., 1999Hwan and Chou, 1999
Comment MSDC-RI MSDC-RI MSDC-RI MSDC-RI MSDC-RI
Column type CapillaryCapillaryCapillaryCapillaryCapillary
Active phase DB-WaxHP Innowax FSPInnowaxCarbowaxDB-Wax
Column length (m) 30.60.60.50.60.
Carrier gas  HeHeN2He
Substrate
Column diameter (mm) 0.530.250.250.20.25
Phase thickness (μm)  0.250.25 0.25
Tstart (C) 60.60.60.80.40.
Tend (C) 210.220.220.200.200.
Heat rate (K/min) 4.  1.2.
Initial hold (min)  10.10. 2.
Final hold (min)  10. 20.
I 1515.1541.1541.1500.1514.
ReferenceIwatsuki, Mizota, et al., 1999Kaya, Baser, et al., 1999Kaya, Baser, et al., 1999, 2Menon, Chacko, et al., 1999Umano, Nakahara, et al., 1999
Comment MSDC-RI MSDC-RI MSDC-RI MSDC-RI MSDC-RI
Column type CapillaryCapillaryCapillaryCapillaryCapillary
Active phase DB-WaxPEG-20MDB-WaxDB-WaxDB-Wax
Column length (m) 60.25.60.30.30.
Carrier gas   HeN2N2
Substrate
Column diameter (mm) 0.250.250.250.250.25
Phase thickness (μm)   1.0.250.25
Tstart (C) 30.50.50.45.45.
Tend (C) 170.230.200.220.220.
Heat rate (K/min) 2.2.3.3.3.
Initial hold (min) 4.
Final hold (min) 30. 40.
I 1516.1531.1507.1542.1527.
ReferenceButtery and Ling, 1998Ding, Deng, et al., 1998Horiuchi, Umano, et al., 1998Molleken U., Sinnwell V., et al., 1998Mölleken, Sinnwell, et al., 1998
Comment MSDC-RI MSDC-RI MSDC-RI MSDC-RI MSDC-RI
Column type CapillaryCapillaryCapillaryCapillaryCapillary
Active phase CBP-20DB-WaxPEG-20MPEG-20MCP-Wax 52CB
Column length (m) 25.60.60.60.50.
Carrier gas   He He
Substrate
Column diameter (mm) 0.250.250.250.250.32
Phase thickness (μm)  0.25  0.25
Tstart (C) 35.50.70.70.50.
Tend (C) 200.230.210.220.210.
Heat rate (K/min) 5.2.3.3.1.5
Initial hold (min) 5.   5.
Final hold (min)     10.
I 1519.1495.1532.1523.1531.
ReferenceQuiroz A. and Niemeyer H.M., 1998Ravichandran and Parthiban, 1998Awano, Honda, et al., 1997Awano, Ichikawa, et al., 1997Chyau, Lin, et al., 1997
Comment MSDC-RI MSDC-RI MSDC-RI MSDC-RI MSDC-RI
Column type CapillaryCapillaryCapillaryCapillaryCapillary
Active phase DB-WaxDB-WaxPEG-20MDB-WaxDB-Wax
Column length (m) 60.60.50.30.30.
Carrier gas HeHeNitrogenHeHe
Substrate
Column diameter (mm) 0.250.250.250.250.25
Phase thickness (μm)   0.250.250.25
Tstart (C) 60.50.60.20.50.
Tend (C) 180.200.180.200.200.
Heat rate (K/min) 2.3.2.4.4.
Initial hold (min)    4.4.
Final hold (min)  40. 10.10.
I 1523.1535.1479.1494.1502.
ReferenceSekiwa, Kubota, et al., 1997Wada and Shibamoto, 1997Kubota, Matsujage, et al., 1996Morales, Albarracín, et al., 1996Morales, Albarracín, et al., 1996
Comment MSDC-RI MSDC-RI MSDC-RI MSDC-RI MSDC-RI
Column type CapillaryCapillaryCapillaryCapillaryCapillary
Active phase DB-WaxTC-WaxSupelcowax-10Carbowax 20MDB-Wax
Column length (m) 60.60.60.60.60.
Carrier gas He He He
Substrate
Column diameter (mm) 0.320.250.250.250.25
Phase thickness (μm) 0.50 0.25 0.25
Tstart (C) 50.80.40.60.50.
Tend (C) 250.240.200.180.180.
Heat rate (K/min) 8.3.3.2.2.5
Initial hold (min) 1.5.3.4.5.
Final hold (min) 6. 30.
I 1503.1535.1518.1482.1490.
ReferenceSagrero-Nieves and Bartley, 1996Shuichi, Masazumi, et al., 1996Wong and Lai, 1996Kawakami, Ganguly, et al., 1995Stashenko, Torres, et al., 1995
Comment MSDC-RI MSDC-RI MSDC-RI MSDC-RI MSDC-RI
Column type CapillaryCapillaryCapillaryCapillaryCapillary
Active phase PEG-20MPEG-20MDB-WaxDB-WaxDB-Wax
Column length (m) 50.50.30.30.30.
Carrier gas HeHeH2H2He
Substrate
Column diameter (mm) 0.250.25  0.25
Phase thickness (μm) 0.150.150.250.250.25
Tstart (C) 60.60.60.60.60.
Tend (C) 180.180.230.230.230.
Heat rate (K/min) 2.2.8.8.8.
Initial hold (min) 4.4.5.5.5.
Final hold (min)   10.10.10.
I 1477.1482.1528.1535.1531.
ReferenceTogari, Kobayashi, et al., 1995Togari, Kobayashi, et al., 1995Steullet and Guerin, 1994Steullet and Guerin, 1994Steullet and Guerin, 1994
Comment MSDC-RI MSDC-RI MSDC-RI MSDC-RI MSDC-RI
Column type CapillaryCapillaryCapillaryCapillaryCapillary
Active phase DB-WaxDB-WaxDB-WaxDB-WaxCarbowax 20M
Column length (m) 30.30.30.60.80.
Carrier gas HeHeHe
Substrate
Column diameter (mm) 0.250.250.250.250.2
Phase thickness (μm) 0.250.250.25
Tstart (C) 60.60.60.60.70.
Tend (C) 230.230.230.220.170.
Heat rate (K/min) 8.8.8.3.2.
Initial hold (min) 5.5.5.4.
Final hold (min) 10.10.10.
I 1532.1532.1532.1558.1502.
ReferenceSteullet and Guerin, 1994Steullet and Guerin, 1994Steullet and Guerin, 1994Chung, Eiserich, et al., 1993Egolf and Jurs, 1993
Comment MSDC-RI MSDC-RI MSDC-RI MSDC-RI MSDC-RI
Column type CapillaryCapillaryCapillaryCapillaryCapillary
Active phase Carbowax 20MDB-WaxDB-WaxCarbowax 20MCarbowax 20M
Column length (m) 50.60.30.45.50.
Carrier gas HeHeHeHydrogenHe
Substrate
Column diameter (mm) 0.250.250.250.320.25
Phase thickness (μm)  0.25 1.0
Tstart (C) 60.50.60.60.60.
Tend (C) 180.230.240.200.180.
Heat rate (K/min) 2.2.3.2.2.
Initial hold (min) 4.4.10.5.4.
Final hold (min)
I 1482.1513.1476.1504.1482.
ReferenceKawakami, Kobayashi, et al., 1993Shimoda, Shiratsuchi, et al., 1993Hatsuko, Kazuko, et al., 1992Kollmannsberger, Nitz, et al., 1992Kawakami and Kobayashi, 1991
Comment MSDC-RI MSDC-RI MSDC-RI MSDC-RI MSDC-RI
Column type CapillaryCapillaryCapillaryCapillaryCapillary
Active phase PEG-20MDB-WaxDB-WaxDB-WaxSupelcowax-10
Column length (m) 50.60.60.60.60.
Carrier gas N2   He
Substrate
Column diameter (mm) 0.250.320.320.320.32
Phase thickness (μm)
Tstart (C) 60.50.50.50.60.
Tend (C) 180.230.230.230.220.
Heat rate (K/min) 2.4.4.4.2.
Initial hold (min)     1.
Final hold (min)  10.10.10.
I 1490.1516.1516.1516.1558.
ReferenceKubota, Nakamoto, et al., 1991Binder, Benson, et al., 1990Binder, Turner, et al., 1990Binder, Turner, et al., 1990, 2Loughrin, Hamilton-Kemp, et al., 1990
Comment MSDC-RI MSDC-RI MSDC-RI MSDC-RI MSDC-RI
Column type CapillaryCapillaryCapillaryCapillaryCapillary
Active phase DB-WaxDB-WaxSupelcowax-10DB-WaxCarbowax 20M
Column length (m)  60.60.60.50.
Carrier gas 30 HeHeN2
Substrate
Column diameter (mm) 0.250.320.250.3220.22
Phase thickness (μm)   0.250.25
Tstart (C) 30.50.40.50.80.
Tend (C) 240.230.175.230.200.
Heat rate (K/min) 50.4.1.4.3.
Initial hold (min) 10.0.15.
Final hold (min)  10.
I 1490.1511.1521.1516.1530.
ReferencePfannhauser, 1990Binder, Flath, et al., 1989Hsieh, Williams, et al., 1989Engel, Flath, et al., 1988Mihara, Tateba, et al., 1988
Comment MSDC-RI MSDC-RI MSDC-RI MSDC-RI MSDC-RI
Column type CapillaryCapillaryCapillaryCapillaryCapillary
Active phase Carbowax 20MDB-WaxDB-WaxDB-WaxCarbowax 20M
Column length (m) 50.60.60.30.150.
Carrier gas N2H2H2Helium
Substrate
Column diameter (mm) 0.220.250.250.320.66
Phase thickness (μm)  0.250.25
Tstart (C) 80.30.30.40.60.
Tend (C) 200.180.180.200.170.
Heat rate (K/min) 3.2.2.6.1.
Initial hold (min)  2.2.1.40.
Final hold (min)
I 1532.1507.1507.1500.1520.
ReferenceMihara, Tateba, et al., 1988Takeoka, Flath, et al., 1988Takeoka, Flath, et al., 1988Andersen J.F., Mikolajczak K.L., et al., 1987Buttery, Ling, et al., 1987
Comment MSDC-RI MSDC-RI MSDC-RI MSDC-RI MSDC-RI
Column type CapillaryCapillaryCapillaryCapillaryCapillary
Active phase Carbowax 20MCarbowax 20MCarbowax 20MCarbowax 20MCarbowax 20M
Column length (m) 50.50.50.150.50.
Carrier gas N2N2Hydrogen
Substrate
Column diameter (mm) 0.220.220.200.640.32
Phase thickness (μm)
Tstart (C) 80.80.50.50.70.
Tend (C) 200.200.200.170.180.
Heat rate (K/min) 3.3.1.1.2.
Initial hold (min)    30.
Final hold (min)   35.60.
I 1530.1532.1489.1520.1500.
ReferenceMihara, Tateba, et al., 1987Mihara, Tateba, et al., 1987Wu, Liou, et al., 1987Buttery, Ling, et al., 1983Engel and Tressl, 1983
Comment MSDC-RI MSDC-RI MSDC-RI MSDC-RI MSDC-RI
Column type PackedCapillaryCapillaryCapillaryCapillary
Active phase CarbowaxCarbowax 20MCarbowax 20MCarbowax 20MCarbowax 20M
Column length (m) 3.31.150.50.150.
Carrier gas HeHeliumHe
Substrate Chromosorb G AW DMCS
Column diameter (mm)  0.500.640.320.64
Phase thickness (μm)
Tstart (C) 60.40.50.70.50.
Tend (C) 180.200.170.190.170.
Heat rate (K/min) 4.10.1.2.1.
Initial hold (min)   10. 30.
Final hold (min)   60.
I 1503.1530.1505.1479.1520.
ReferenceSchieberle and Grosch, 1983Labropoulos, Palmer, et al., 1982Seifert and King, 1982Tressl, Bahri, et al., 1982Buttery, Parker, et al., 1981
Comment MSDC-RI MSDC-RI MSDC-RI MSDC-RI MSDC-RI
Column type Capillary
Active phase Carbowax 20M
Column length (m) 150.
Carrier gas
Substrate
Column diameter (mm) 0.64
Phase thickness (μm)
Tstart (C) 50.
Tend (C) 170.
Heat rate (K/min) 1.
Initial hold (min) 30.
Final hold (min)
I 1530.
ReferenceButtery, Ling, et al., 1980
Comment MSDC-RI

Normal alkane RI, non-polar column, custom temperature program

Data compiled by: NIST Mass Spectrometry Data Center, William E. Wallace, director

Column type CapillaryCapillaryCapillaryCapillaryCapillary
Active phase TR-5 MSTR-5 MSSLB-5 MSSLB-5 MSPolydimethyl siloxane with 5 % Ph groups
Column length (m) 15.15.30.30.
Carrier gas HeliumHeliumHeliumHelium
Substrate
Column diameter (mm) 0.250.250.250.25
Phase thickness (μm) 0.250.250.250.25
Program 35 0C (3 min) 2 0C/min -> 60 0C (3 min) 2 0C/min -> 80 0C (3 min) 4 0C/min -> 120 0C (3 min) 5 0C/min -> 150 0C (3 min) 15 0C/min -> 240 0C (10 min)35 0C (3 min) 2 0C/min -> 60 0C (3 min) 2 0C/min -> 80 0C (3 min) 4 0C/min -> 120 0C (3 min) 5 0C/min -> 150 0C (3 mion) 15 0C/min -> 240 0C (10 min)not specifiednot specifiednot specified
I 952.969.960.967.969.
ReferenceKurashov, Mitrukova, et al., 2014Kurashov, Krylova, et al., 2013Mondello, 2012Mondello, 2012Robinson, Adams, et al., 2012
Comment MSDC-RI MSDC-RI MSDC-RI MSDC-RI MSDC-RI
Column type CapillaryCapillaryCapillaryCapillaryCapillary
Active phase Polydimethyl siloxane with 5 % Ph groupsSiloxane, 5 % Ph DB-55 % Phenyl polydimethyl siloxane
Column length (m)    30.
Carrier gas    Helium
Substrate
Column diameter (mm)    0.25
Phase thickness (μm)    0.25
Program not specifiednot specifiednot specifiednot specifiednot specified
I 972.956.960.960.961.
ReferenceRobinson, Adams, et al., 2012VOC BinBase, 2012Brandi, Bar, et al., 2011Cao, Li, et al., 2011Chaverri, Diaz, et al., 2011
Comment MSDC-RI MSDC-RI MSDC-RI MSDC-RI MSDC-RI
Column type CapillaryCapillaryCapillaryCapillaryCapillary
Active phase CP-Sil 8 CBHP-5DB-5Polydimethyl siloxane, 5 % phenylZB-1 MS
Column length (m) 30.30.60. 30.
Carrier gas HydrogenHeliumHelium Helium
Substrate
Column diameter (mm) 0.250.320.25 0.25
Phase thickness (μm) 0.250.251.00 0.25
Program 30 0C 3 0C/min -> 150 0C 20 0C/min -> 220 0Cnot specified40 0C 4 0C/min -> 230 0C 100 0C/min -> 260 0C (11.7 min)not specified50 0C 3 0C/min -> 150 0C (10 min) 10 0C/min -> 250 0C
I 963.960.985.956.982.
Referencede Freitas, Garruti, et al., 2011Kahriman, Tosun, et al., 2011Miyazaki, Plotto, et al., 2011Skogerson, Wohlgemuth, et al., 2011Al-Reza, Rahman, et al., 2010
Comment MSDC-RI MSDC-RI MSDC-RI MSDC-RI MSDC-RI
Column type CapillaryCapillaryCapillaryCapillaryCapillary
Active phase CP-Sil 8 CBHP-5HP-5 MSDB-1ZB-1 MS
Column length (m) 30.30.30.30.30.
Carrier gas HeliumHeliumHeliumHeliumHelium
Substrate
Column diameter (mm) 0.250.320.320.250.25
Phase thickness (μm) 0.250.250.250.250.25
Program Multi-rise programnot specifiednot specifiednot specified50 0C 3 0C/min -> 150 0C (10 min) 10 0C/min -> 250 0C
I 965.960.960.961.982.
ReferenceDi Giusto, Bessiere, et al., 2010Kahriman, Tosun, et al., 2010Pino, Marquez, et al., 2010Xu, Tang, et al., 2010Al-Reza, Rahman, et al., 2009
Comment MSDC-RI MSDC-RI MSDC-RI MSDC-RI MSDC-RI
Column type CapillaryCapillaryCapillaryCapillaryCapillary
Active phase DB-1HP-5 MSHP-5 MSDB-1DB-1
Column length (m) 60.30.30.30.30.
Carrier gas HeliumHeliumHeliumHydrogenHydrogen
Substrate
Column diameter (mm) 0.250.250.250.250.25
Phase thickness (μm) 0.250.250.250.250.25
Program 50 0C (5 min) 3 0C/min -> 120 0C 5 0C/min -> 250 0C (3 min) 15 0C/min -> 300 0C (20 min)40 0C (3 min) 3 0C/min -> 160 0C (2 min) 8 0C/min -> 220 0C (3 min)40 0C (5 min) 2 0C/min -> 270 0C -> 260 0C (20 min)45 0C 3 0C/min -> 175 0C 15 0C/min -> 300 0C (10 min)45 0C 3 0C/min -> 175 0C 15 0C/min -> 300 0C (10 min)
I 934.962.963.927.927.
ReferenceDelort and Jaquier, 2009Fan, Lu, et al., 2009Mancini, Arnold, et al., 2009Mendes, Trindade, et al., 2009Mendes, Trindade, et al., 2009, 2
Comment MSDC-RI MSDC-RI MSDC-RI MSDC-RI MSDC-RI
Column type CapillaryCapillaryCapillaryCapillaryCapillary
Active phase HP-5HP-5ZB-5DB-5CP-Sil 5 Cb
Column length (m) 50.60.30.30.50.
Carrier gas HeliumHeliumHeliumHeliumNitrogen
Substrate
Column diameter (mm) 0.320.250.250.250.32
Phase thickness (μm) 1.050.250.250.251.20
Program not specified30 0C (2 min) 2 0Cmin -> 60 0C 10 0C/min -> 100 0C 20 0C/min -> 140 0C 10 0C/min -> 200 0C (10 min)45 0C 3 0C/min -> 230 0C (10 min) 10 0C/min -> 270 0C (21 min)not specified40 0C 20 0C/min -> 85 0C 1 0C/min -> 145 0C 3 0C/min -> 250 0C (30 min)
I 965.969.962.961.930.
ReferencePugliese, Sirtori, et al., 2009Rotsatschakul, Visesanguan, et al., 2009de Simon, Estruelas, et al., 2009Bastos, Ishimoto, et al., 2008Collin, Nizet, et al., 2008
Comment MSDC-RI MSDC-RI MSDC-RI MSDC-RI MSDC-RI
Column type CapillaryCapillaryCapillaryCapillaryCapillary
Active phase SLB-5 MSSLB-5 MSCP Sil 8 CBHP-5HP-5
Column length (m) 30.30.30.30.30.
Carrier gas HeliumHelium HeliumHelium
Substrate
Column diameter (mm) 0.250.250.250.250.25
Phase thickness (μm) 0.250.250.250.250.25
Program 50 0C 3 0C/min -> 250 0C (1 min) 10 0C/min -> 300 0C (5 min)not specified60C => 2.5C/min => 170C => 10C/min => 250C (5min)40 0C (3 min) 3 0C/min -> 160 0C (2 min) 8 0C/min -> 220 0C (3 min)not specified
I 960.952.961.958.968.
ReferenceCosta, De Fina, et al., 2008Costa, De Fina, et al., 2008Kristiawan, Sobolik, et al., 2008Qiao, Xie, et al., 2008Qiao, Xie, et al., 2008
Comment MSDC-RI MSDC-RI MSDC-RI MSDC-RI MSDC-RI
Column type CapillaryCapillaryCapillaryCapillaryCapillary
Active phase SLB-5MSDB-5 MSHP-5 MSHP-5 MSHP-5
Column length (m) 10.30.30.30.30.
Carrier gas HeliumHeliumHeliumHelium
Substrate
Column diameter (mm) 0.180.320.250.250.25
Phase thickness (μm) 0.181.00.250.250.25
Program not specified-10 0C (3 min) 50 0C/min -> 40 0C 5 0C/min -> 290 0C (5 min)40 0C (2 min) 4 0C/min -> 220 0C 20 0C/min -> 280 0C40 0C (2 min) 4 0C/min -> 220 0C 20 0C/min -> 280 0C40 0C (2 min) 5 0C/min -> 80 0C 7 oC/min -> 160 0C 9 0C/min -> 200 0C 20 0C/min -> 280 0C (10 min)
I 960.970.958.961.959.
ReferenceRisticevic, Carasek, et al., 2008Watanabe, Ueda, et al., 2008Xie, Sun, et al., 2008Xie, Sun, et al., 2008Zhao, Li, et al., 2008
Comment MSDC-RI MSDC-RI MSDC-RI MSDC-RI MSDC-RI
Column type CapillaryCapillaryCapillaryCapillaryCapillary
Active phase HP-5DB-5 MSDB-5 MSHP-1DB-5
Column length (m) 30.30.30.50.30.
Carrier gas  HeliumHeliumHe
Substrate
Column diameter (mm) 0.250.250.250.20.25
Phase thickness (μm) 0.250.250.250.330.25
Program not specified50 0C (2.8 min) 5.5 0C/min -> 140 0C (1 min) 4.5 oC/min -> 220 0C -> 225 0C (2 min) 3.4 0C/min -> 265 0C (5 min)50 0C (2.8 min) 5.5 0C/min -> 140 0C (1 min) 4.5 oC/min -> 220 0C -> 225 0C (2 min) 3.4 0C/min -> 265 0C (5 min)40C(2min) => 2C/min => 200C => 15C/min => 250C (30min)50C(1min) => 5C/min => 100C => 10C/min => 250C (9min)
I 986.920.960.930.962.
ReferenceZhao, Li, et al., 2008Zhu, Li, et al., 2008Zhu, Li, et al., 2008Barra, Baldovini, et al., 2007Beaulieu and Lancaster, 2007
Comment MSDC-RI MSDC-RI MSDC-RI MSDC-RI MSDC-RI
Column type CapillaryCapillaryCapillaryCapillaryCapillary
Active phase DB-5 MSDB-5 MSHP-5MSHP-5 MSHP-5MS
Column length (m) 30.30.30.30.30.
Carrier gas HeliumHeliumHeHeliumHe
Substrate
Column diameter (mm) 0.250.250.250.250.25
Phase thickness (μm) 0.250.250.250.250.25
Program 45 0C (0.75 min) 10 0C/min -> 200 0C 30 0C/min -> 245 0C (1.25 min)45 0C (0.75 min) 10 0C/min -> 200 0C 30 0C/min -> 245 0C (1.25 min)40C => 3C/min => 100C => 5C/min => 230C(2min)40 0C (5 min) 2 0C/min -> 250 0C (15 min) 10 0C/min -> 270 0C50C(2min) => 20C/min => 80C (1min) => 20C/min => 100C(1min) => 30C/min => 230C(3min)
I 972.972.958.963.956.
ReferenceCajka, Hajslova, et al., 2007Cajka, Hajslova, et al., 2007Chokeprasert P., Charles A.L., et al., 2007Formisano, Rigano, et al., 2007Ho, Wan Aida, et al., 2007
Comment MSDC-RI MSDC-RI MSDC-RI MSDC-RI MSDC-RI
Column type CapillaryCapillaryCapillaryCapillaryCapillary
Active phase DB-1DB-5 MSDB-5CP Sil 8 CBHP-1
Column length (m) 60.60.30.30.30.
Carrier gas N2HeliumHeHeHe
Substrate
Column diameter (mm) 0.250.320.250.250.2
Phase thickness (μm) 0.251.00.250.250.33
Program 40C(1min) => 5C/min => 150C => 10C/min => 200C(9min)40 0C (2 min) 6 0C/min -> 100 0C 4 0C/min -> 180 0C 8 0C/min -> 250 0C (12 min)not specified50C(3min) => 3C/min => 100C => 2.7C/min => 140C => 2.4C/min => 180C => 6C/min => 250C60C(5min) => 3C/min => 180C => 20C/min => 280C(10min)
I 921.973.961.963.966.
ReferenceLin, Peng, et al., 2007Liu, Xu, et al., 2007Machado, Bastos, et al., 2007Meekijjaroenroj, Bessière, et al., 2007Merle, Verdeguer, et al., 2007
Comment MSDC-RI MSDC-RI MSDC-RI MSDC-RI MSDC-RI
Column type CapillaryCapillaryCapillaryCapillaryCapillary
Active phase DB-5HP-5 MSHP-5HP-5MSHP-5
Column length (m) 50.30. 30.26.
Carrier gas HeliumHeliumHeHeHe
Substrate
Column diameter (mm) 0.320.25 0.250.2
Phase thickness (μm) 0.25   0.25
Program 60 0C (1 min) 5 0C/min -> 160 0C 10 0C/min -> 250 0C40 0C (10 min) 3 oC/min -> 200 0C 2 0C/min -> 220 0C50C => 3C/min => 200C(10min) => 10C/min => 290C(10min)40C(10min) => 3C/min => 200C => 2C/min => 220C60C(5min) => 6C/min => 200C => 15C/min => 250C(5min)
I 960.968.949.973.938.
ReferenceNivinsliene, Butkiene, et al., 2007Setzer, Stokes, et al., 2007Splivallo, Bossi, et al., 2007Takaku, Haber, et al., 2007Baroni, Nores, et al., 2006
Comment MSDC-RI MSDC-RI MSDC-RI MSDC-RI MSDC-RI
Column type CapillaryCapillaryCapillaryCapillaryCapillary
Active phase 5 % Phenyl methyl siloxaneUltra-2OV-101BP-5HP-5 MS
Column length (m) 30.25. 30.30.
Carrier gas  H2 HeHelium
Substrate
Column diameter (mm) 0.250.25 0.250.25
Phase thickness (μm) 0.750.33 1.0.25
Program 50C(1min) => 5C/min => 100C => 10C/min => 190C => 30C/min => 250C(1min)not specifiednot specified40C(2min) => 4C/min => 150C => 8C/min => 250C (15min)40 0C (10 min) 3 0C/min -> 200 0C 2 0C/min -> 220 0C
I 966.961.951.964.961.
ReferenceBeaulieu J.C. and Lea J.M., 2006Ceva-Antunes, Bizzo, et al., 2006Ebrahimi and Hadjmohammadi, 2006Helsper, Bücking, et al., 2006Schmidt, Noletto, et al., 2006
Comment MSDC-RI MSDC-RI MSDC-RI MSDC-RI MSDC-RI
Column type CapillaryCapillaryCapillaryCapillaryCapillary
Active phase SE-52RTX-5RTX-5HP-5MSDB-5MS
Column length (m) 30.30.30.30.30.
Carrier gas HeN2N2He
Substrate
Column diameter (mm) 0.320.250.250.250.25
Phase thickness (μm) 0.150.250.250.250.25
Program 45C => 1C/min => 100C => 5C/min => 250C (10min)not specifiednot specified40C(3min) => 2C/min => 180C => 10C/min => 250C(5min)70C(2min) => 10C/min => 150C(15min) => 5C/min => 240C
I 963.965.968.962.989.
ReferenceTognolini, Barocelli, et al., 2006Ádámová, Orinák, et al., 2005Ádámová, Orinák, et al., 2005Alissandrakis, Kibaris, et al., 2005Bagci and Baser, 2005
Comment MSDC-RI MSDC-RI MSDC-RI MSDC-RI MSDC-RI
Column type CapillaryCapillaryCapillaryCapillaryCapillary
Active phase Methyl SiliconeDB-1CP-Sil5 CB MSPolydimethyl siloxane with 5 % Ph groupsHP-5
Column length (m) 60.60.50.
Carrier gas HeliumHe
Substrate
Column diameter (mm) 0.320.320.32
Phase thickness (μm) 1.00.251.2
Program -50 0C (2 min) 8 0C/min -> 200 0C (7.75 min) 25 0C -> 225 0C (8 min)33C(5min) => 2C/min => 50c => 5C/min => 225C36C(2min) => 20C/min => 85C => 1C/min => 145C => 3C/min => 250C(30min)not specifiednot specified
I 940.917.930.960.953.
ReferenceBlunden, Aneja, et al., 2005Cramer, Mattinson, et al., 2005Iraqi, Vermeulen, et al., 2005Pino, Marbot, et al., 2005Riu-Aumatell, Lopez-Tamames, et al., 2005
Comment MSDC-RI MSDC-RI MSDC-RI MSDC-RI MSDC-RI
Column type CapillaryCapillaryCapillaryCapillaryCapillary
Active phase HP-5 MSCP Sil 5 CBSPB-5HP-5DB-5
Column length (m) 30.50.30.50.50.
Carrier gas Helium He
Substrate
Column diameter (mm) 0.250.320.250.320.32
Phase thickness (μm) 0.251.20.251.051.05
Program 35 0C (1 min) 120 0C/min -> 60 0C 1.5 0C/min -> 100 0C 5 0C/min -> 280 0C36C => 20C/min => 85C => 1C/min => 145C => 3C/min => 250C(30min)30C(3min) => 5C/min => 80C => 4C/min => 95C => 5C/min => 115C => 10C/min => 200C40C(10min) => 5C/min => 200C => 20C/min => 250C(5min)40C(10min) => 5C/min => 200C => 20C/min => 250C (5min)
I 962.933.974.970.970.
ReferenceTurchini, Giani, et al., 2005Counet, Ouwerx, et al., 2004Crook, Boylston, et al., 2004Garcia-Estaban, Ansorena, et al., 2004Garcia-Estaban, Ansorena, et al., 2004, 2
Comment MSDC-RI MSDC-RI MSDC-RI MSDC-RI MSDC-RI
Column type CapillaryCapillaryCapillaryCapillaryCapillary
Active phase MDN-5SE-30DB-1SPB-5DB-5
Column length (m) 30. 30.60.60.
Carrier gas Helium H2
Substrate
Column diameter (mm) 0.25 0.250.320.25
Phase thickness (μm) 0.25 0.251.0.25
Program 35 0C (1 min) 120 0C/min -> 60 0C 2 0C/min -> 280 0Cnot specified40C(10min) => 2C/min => 110C => 5C/min => 200C(10min)not specified35C => 5C/min => 120C => 2C/min => 160C => 7C/min => 250C
I 945.947.969.964.966.
ReferenceTurchimi, Mentasti, et al., 2004Vinogradov, 2004Alves and Franco, 2003Begnaud, Pérès, et al., 2003Chung, Heymann, et al., 2003
Comment MSDC-RI MSDC-RI MSDC-RI MSDC-RI MSDC-RI
Column type CapillaryCapillaryCapillaryCapillaryCapillary
Active phase HP-5SE-54  CP Sil 5 CB
Column length (m) 30.50.  50.
Carrier gas  H2
Substrate
Column diameter (mm) 0.250.20  0.32
Phase thickness (μm) 0.250.25  1.2
Program 40C(6min) => 2.5C/min => 150C => 90C/min => 250C50 0C (8 min) 1 0C/min -> 75 0C 2 0C/min -> 110 0C 5 0C/min -> 200 0Cnot specifiednot specified36C => 20C/min => 85C => 1C/min => 145C=3C/min => 250C(30min)
I 962.969.925.926.935.
ReferenceJordán, Margaría, et al., 2003Bastos, Franco, et al., 2002Bruce, Cork, et al., 2002Bruce, Cork, et al., 2002Counet, Callemien, et al., 2002
Comment MSDC-RI MSDC-RI MSDC-RI MSDC-RI MSDC-RI
Column type CapillaryCapillaryCapillaryCapillaryCapillary
Active phase DB-5MSCP Sil 5 CBHP-5HP-5Methyl phenyl siloxane (not specified)
Column length (m)  50.30.30.
Carrier gas  He
Substrate
Column diameter (mm)  0.320.250.25
Phase thickness (μm)  1.20.250.25
Program not specified36C => 20C/min => 85C => 1C/min => 145C => 3C/min => 250Cnot specifiednot specifiednot specified
I 937.933.962.954.966.
ReferenceFu, Yoon, et al., 2002Guyot-Declerck, Renson, et al., 2002Jordán, Goodner, et al., 2002Jordán, Goodner, et al., 2002Poligne, Collignan, et al., 2002
Comment MSDC-RI MSDC-RI MSDC-RI MSDC-RI MSDC-RI
Column type CapillaryCapillaryCapillaryCapillaryCapillary
Active phase DB-5DB-5DB-5DB-5HP-5MS
Column length (m) 30.30.30. 30.
Carrier gas     He
Substrate
Column diameter (mm) 0.200.200.20 0.25
Phase thickness (μm) 1.01.01.0 0.25
Program not specifiednot specifiednot specifiednot specified40C (10min) => 3C/min => 120C => 10C/min => 250C (5min)
I 953.953.953.968.959.
ReferenceRapior, Breheret, et al., 2002Rapior, Breheret, et al., 2002Rapior, Breheret, et al., 2002Staples E.S., 2002Ansorena, Gimeno, et al., 2001
Comment MSDC-RI MSDC-RI MSDC-RI MSDC-RI MSDC-RI
Column type CapillaryCapillaryCapillaryCapillaryCapillary
Active phase BP-1Methyl SiliconeCP Sil 8 CBDB-5 MSBPX-5
Column length (m) 50. 60.30.30.
Carrier gas He  HeliumHe
Substrate
Column diameter (mm) 0.25 0.250.250.25
Phase thickness (μm) 1. 0.251.00.25
Program -50C => 49.9C/min => 5C(3min) => 3C/min => 50C => 5C/min => 220C(20 min)not specifiednot specifiednot specified50C(2min) => 10C/min => 110C => 5.7C/min => 200C => 40C/min => 250C(5min)
I 920.42965.983.972.986.
ReferenceCooke, Hassoun, et al., 2001N/ADuckham, Dodson, et al., 2001Luo and Agnew, 2001Sides, Robards, et al., 2001
Comment MSDC-RI MSDC-RI MSDC-RI MSDC-RI MSDC-RI
Column type CapillaryCapillaryCapillaryCapillaryCapillary
Active phase HP-1OV-101HP-5BPX-5CP Sil 5 CB
Column length (m) 50.50.30.50.50.
Carrier gas N2N2HeHeliumHe
Substrate
Column diameter (mm) 0.320.250.250.320.32
Phase thickness (μm) 0.52 0.250.50
Program 40C => 2C/min => 130C => 4C/min => 250Cnot specified40C (10min) => 3C/min => 120C => 10C/min => 250C (5min)40 0C (5 min) 20 0C/min -> 60 0C (5 min) 4 0C/min -> 250 0C (10 min)30C => 55C/min => 85C => 1C/min => 145C => 3C/min => 250C
I 928.947.959.982.940.
ReferenceTeai, Claude-Lafontaine, et al., 2001Yang, 2001Ansorena, Astiasarán, et al., 2000Madruga, Arruda, et al., 2000Guyot, Scheirman, et al., 1999
Comment MSDC-RI MSDC-RI MSDC-RI MSDC-RI MSDC-RI
Column type CapillaryCapillaryCapillaryCapillaryCapillary
Active phase SE-54SE-54CP Sil 5 CBDB-5HP-1
Column length (m) 25.25.50.30.25.
Carrier gas   HeHe
Substrate
Column diameter (mm) 0.310.310.320.320.32
Phase thickness (μm)   1.20.25
Program not specifiednot specified30C => 55C/min => 85C => 1C/min => 145C => 3C/min => 250C35C(1min) => 40C/min => 60C (1min) => 6C/min => 230Cnot specified
I 955.956.939.959.926.
ReferenceDing, Deng, et al., 1998Ding, Deng, et al., 1998Guyot, Bouseta, et al., 1998Matsui, Guth, et al., 1998Ong, Acree, et al., 1998
Comment MSDC-RI MSDC-RI MSDC-RI MSDC-RI MSDC-RI
Column type CapillaryCapillaryCapillaryCapillaryCapillary
Active phase HP-5SPB-1DB-5DB-5DB-5
Column length (m) 50.60.50.50.50.
Carrier gas HeHeHeHeHe
Substrate
Column diameter (mm) 0.320.530.320.320.32
Phase thickness (μm) 0.525.0.250.250.25
Program 35 0C 10 0C/min -> 200 0C (20 min) 5 0C/min -> 230 0C (50 min)40C(6min) => 5C/min => 80C => 10C/min => 200C40C(10min) => 3C/min => 95C => 10C/min => 270C(10min)40C (10min) => 3C/min => 95C => 10C/min => 270C (10min)40C (10min) => 3C/min => 95C => 10C/min => 270C (10min)
I 961.948.973.971.972.
ReferenceTimón, Ventanas, et al., 1998Flanagan, Streete, et al., 1997Mateo, Aguirrezábal, et al., 1997Mateo and Zumalacárregui, 1996Mateo and Zumalacárregui, 1996
Comment MSDC-RI MSDC-RI MSDC-RI MSDC-RI MSDC-RI
Column type CapillaryCapillaryCapillaryCapillaryCapillary
Active phase RSL-150DB-1DB-5DB-1SPB-1
Column length (m) 60.60.30.60.60.
Carrier gas He   Helium
Substrate
Column diameter (mm) 0.320.320.250.320.53
Phase thickness (μm) 0.250.25 0.255.0
Program 30c (1.5min) => 20C/min => 55C => 6C/min => 200C(10min)not specifiednot specified3 min at 5 C; 5 - 50 C at 3 deg/min; 50 - 220 C at 5 deg/min40 0C (6 min) 5 0C/min -> 80 0C 10 0C/min -> 200 0C
I 931.924.960.924.948.
ReferenceBuchbauer, Nikiforov, et al., 1994Ciccioli, Cecinato, et al., 1994Garneau, Bouhajib, et al., 1994Ciccioli, Brancaleoni, et al., 1993Strete, Ruprah, et al., 1992
Comment MSDC-RI MSDC-RI MSDC-RI MSDC-RI MSDC-RI
Column type CapillaryCapillaryCapillaryCapillaryCapillary
Active phase SPB-1SE-54DB-1DB-1DB-1
Column length (m) 60.50.60.30.30.
Carrier gas HeliumHe H2H2
Substrate
Column diameter (mm) 0.530.320.320.250.25
Phase thickness (μm) 5.0  0.250.25
Program not specified35 0C (5 min) 8 0C/min -> 200 0C 2 0C/min -> 250 0Cnot specified30C (2min) => 2C/min => 150C => 4C/min => 250C30C (2min) => 2C/min => 150C => 4C/min => 250C
I 956.976.926.917.926.
ReferenceStrete, Ruprah, et al., 1992Um, Bailey, et al., 1992Binder, Flath, et al., 1989Takeoka, Flath, et al., 1988Takeoka, Flath, et al., 1988
Comment MSDC-RI MSDC-RI MSDC-RI MSDC-RI MSDC-RI
Column type CapillaryCapillaryCapillaryCapillary
Active phase OV-101OV-1, SE-30, Methyl silicone, SP-2100, OV-101, DB-1, etc.OV-1, SE-30, Methyl silicone, SP-2100, OV-101, DB-1, etc.OV-1
Column length (m)  50.50.
Carrier gas  HydrogenHydrogen
Substrate
Column diameter (mm)  0.320.32
Phase thickness (μm)
Program not specifiednot specifiednot specifiednot specified
I 947.929.961.947.
ReferenceShibamoto, 1987Waggott and Davies, 1984Waggott and Davies, 1984Ramsey and Flanagan, 1982
Comment MSDC-RI MSDC-RI MSDC-RI MSDC-RI

Kovats' RI, polar column, custom temperature program

Data compiled by: NIST Mass Spectrometry Data Center, William E. Wallace, director

Column type CapillaryCapillaryCapillaryCapillaryCapillary
Active phase Polyethylene GlycolPolyethylene GlycolCarbowax 20MCarbowaxCarbowax 20M
Column length (m)   30.127.
Carrier gas   H2
Substrate
Column diameter (mm)   0.250.75
Phase thickness (μm)
Program not specifiednot specified50 0C (8 min) 4 K/min -> 110 0C 16 K/min -> 200 0Cnot specifiednot specified
I 1522.1522.1498.1553.1538.
ReferenceBruce, Cork, et al., 2002Bruce, Cork, et al., 2002Garruti, Franco, et al., 2001Okamoto, Ellison, et al., 1981Brander, Kepner, et al., 1980
Comment MSDC-RI MSDC-RI MSDC-RI MSDC-RI MSDC-RI
Column type Capillary
Active phase Carbowax 20M
Column length (m)
Carrier gas
Substrate
Column diameter (mm)
Phase thickness (μm)
Program not specified
I 1540.
ReferenceBrander, Kepner, et al., 1980
Comment MSDC-RI

References

Ambrose, Connett, et al., 1975
Ambrose, D.; Connett, J.E.; Green, J.H.S.; Hales, J.L.; Head, A.J.; Martin, J.F.,
Thermodynamic properties of organic oxygen compounds. 42. Physical and thermodynamic properties of benzaldehyde,
J. Chem. Thermodyn., 1975, 7, 1143-1157. [all data]
Kudchadker and Kudchadker, 1975
Kudchadker, S.A.; Kudchadker, A.P.,
Thermodynamic properties of oxygen compounds. III. Benzaldehyde and furfural (2-furaldehyde),
Ber. Bunsenges. Phys. Chem., 1975, 12, 432-437. [all data]
Lebedeva and Katin, 1972
Lebedeva, N.D.; Katin, Yu.A.,
Heats of combustion of certain monosubstituted benzenes,
Russ. J. Phys. Chem. (Engl. Transl.), 1972, 46, 1088. [all data]
Pedley, Naylor, et al., 1986
Pedley, J.B.; Naylor, R.D.; Kirby, S.P.,
Thermochemical Data of Organic Compounds, Chapman and Hall, New York, 1986, 1-792. [all data]
Solly and Benson, 1971
Solly, R.K.; Benson, S.W.,
Thermochemistry of the reaction of benzaldehyde with iodine. The enthalpy of formation of benzaldehyde and benzoyl iodide,
J. Chem. Thermodyn., 1971, 3, 203-209. [all data]
Landrieu, Baylocq, et al., 1929
Landrieu, P.; Baylocq, F.; Johnson, J.R.,
Etude thermochimique dans la serie furanique,
Bull. Soc. Chim. France, 1929, 45, 36-49. [all data]
Ambrose D., 1975
Ambrose D.,
Thermodynamic properties of organic oxygen compounds. 42. Physical and thermodynamic properties of benzaldehyde,
J. Chem. Thermodyn., 1975, 7, 1143-1157. [all data]
Sarin V.N., 1973
Sarin V.N.,
Thermodynamic properties in the gaseous state of certain monosubstituted benzenes,
Thermochim. Acta, 1973, 6, 39-46. [all data]
Kudchadker S.A., 1975
Kudchadker S.A.,
Thermodynamic properties of oxygen compounds. III. Benzaldehyde and furfural (2-furaldehyde),
Thermochim. Acta, 1975, 12, 432-437. [all data]
de Kolossowsky and Udowenko, 1934
de Kolossowsky, N.; Udowenko, W.W.,
Determination des chaleurs specifiques des liquides,
Compt. rend., 1934, 198, 1394-1395. [all data]
Kolosovskii and Udovenko, 1934
Kolosovskii, N.A.; Udovenko, W.W.,
Specific heat of liquids. II.,
Zhur. Obshchei Khim., 1934, 4, 1027-1033. [all data]
Buckingham and Donaghy, 1982
Buckingham, J.; Donaghy, S.M.,
Dictionary of Organic Compounds: Fifth Edition, Chapman and Hall, New York, 1982, 1. [all data]
Biltz, Fischer, et al., 1930
Biltz, W.; Fischer, W.; Wunnenberg, E.,
Molecular and Atomic Volumes. The Volume Requirements of Crystalline Organic Compounds and Low Temperatures,
Z. Phys. Chem., Abt. A, 1930, 151, 13-55. [all data]
Timmermans, 1921
Timmermans, J.,
The Freezing Points of Organic Substances IV. New Exp. Determinations,
Bull. Soc. Chim. Belg., 1921, 30, 62. [all data]
Altschul and Von Schneider, 1895
Altschul, M.; Von Schneider, B.,
Freezing points of some organic fluids,
Z. Phys. Chem., Stoechiom. Verwandtschaftsl., 1895, 16, 24. [all data]
Ambrose, Connett, et al., 1975, 2
Ambrose, D.; Connett, J.E.; Green, J.H.S.; Hales, J.L.; Head, A.J.; Martin, J.F.,
Thermodynamic properties of organic oxygen compounds 42. Physical and thermodynamic properties of benzaldehyde,
J. Chem. Thermodyn., 1975, 7, 1143. [all data]
Anselme and Teja, 1990
Anselme, M.J.; Teja, A.S.,
The critical properties of rapidly reacting substances,
AIChE Symp. Ser., 1990, 86, 279, 128-32. [all data]
Glaser and Ruland, 1957
Glaser, F.; Ruland, H.,
Untersuchungsen über dampfdruckkurven und kritische daten einiger technisch wichtiger organischer substanzen,
Chem. Ing. Techn., 1957, 29, 772. [all data]
Weast and Grasselli, 1989
CRC Handbook of Data on Organic Compounds, 2nd Editon, Weast,R.C and Grasselli, J.G., ed(s)., CRC Press, Inc., Boca Raton, FL, 1989, 1. [all data]
Stephenson and Malanowski, 1987
Stephenson, Richard M.; Malanowski, Stanislaw,
Handbook of the Thermodynamics of Organic Compounds, 1987, https://doi.org/10.1007/978-94-009-3173-2
. [all data]
De Maré, Lehman, et al., 1973
De Maré, G.R.; Lehman, T.; Termonia, M.,
The vapour pressure of benzaldehyde between 273 and 376 K,
The Journal of Chemical Thermodynamics, 1973, 5, 6, 829-832, https://doi.org/10.1016/S0021-9614(73)80044-8
. [all data]
Stull, 1947
Stull, Daniel R.,
Vapor Pressure of Pure Substances. Organic and Inorganic Compounds,
Ind. Eng. Chem., 1947, 39, 4, 517-540, https://doi.org/10.1021/ie50448a022
. [all data]
Domalski and Hearing, 1996
Domalski, Eugene S.; Hearing, Elizabeth D.,
Heat Capacities and Entropies of Organic Compounds in the Condensed Phase. Volume III,
J. Phys. Chem. Ref. Data, 1996, 25, 1, 1, https://doi.org/10.1063/1.555985
. [all data]
Paul and Kebarle, 1991
Paul, G.J.C.; Kebarle, P.,
Stabilities of Complexes of Br- with Substituted Benzenes (SB) Based on Determinations of the Gas-Phase Equilibria Br- + SB = (BrSB)-,
J. Am. Chem. Soc., 1991, 113, 4, 1148, https://doi.org/10.1021/ja00004a014
. [all data]
Reents and Freiser, 1981
Reents, W.D.; Freiser, B.S.,
Gas-Phase Binding Energies and Spectroscopic Properties of NO+ Charge-Transfer Complexes,
J. Am. Chem. Soc., 1981, 103, 2791. [all data]
Farid and McMahon, 1978
Farid, R.; McMahon, T.B.,
Gas-Phase Ion-Molecule Reactions of Alkyl Nitrites by Ion Cyclotron Resonance Spectroscopy,
Int. J. Mass Spectrom. Ion Phys., 1978, 27, 2, 163, https://doi.org/10.1016/0020-7381(78)80037-0
. [all data]
Briner and Chastonay, 1954
Briner, E.; Chastonay, P.,
Etude thermochemique de l'autoxydation de Valdehyde benzoique,
Helv. Chim. Acta, 1954, 238, 539-541. [all data]
Cox and Pilcher, 1970
Cox, J.D.; Pilcher, G.,
Thermochemistry of Organic and Organometallic Compounds, Academic Press, New York, 1970, 1-636. [all data]
Hao, Chang, et al., 1985
Hao, J.; Chang, J.; Wang, K.; Liu, Y.; Zhong, G.,
Heat of reaction of chalcone by calorimetric measurement,
Huaxue Tongbao, 1985, 15-16. [all data]
Landrieu, 1905
Landrieu, M.Ph.,
Thermochimie. - Thermochimie des hydrazones,
Compt. Rend., 1905, 141, 358-361. [all data]
Cubberley and Mueller, 1946
Cubberley, A.H.; Mueller, M.B.,
Equilibrium studies on the dehydrogenation of primary and secondary alcohols. I. 2-Butanol, 2-octanol, cyclopentanol and benzyl alcohol,
J. Am. Chem. Soc., 1946, 68, 1149-1151. [all data]
Hunter and Lias, 1998
Hunter, E.P.; Lias, S.G.,
Evaluated Gas Phase Basicities and Proton Affinities of Molecules: An Update,
J. Phys. Chem. Ref. Data, 1998, 27, 3, 413-656, https://doi.org/10.1063/1.556018
. [all data]
Wentworth, Kao, et al., 1975
Wentworth, W.E.; Kao, L.W.; Becker, R.S.,
Electron affinities of substituted aromatic compounds,
J. Phys. Chem., 1975, 79, 1161. [all data]
Wentworth and Chen, 1967
Wentworth, W.E.; Chen, E.,
Experimental Determination of the Electron Affinity of Several Aromatic Aldehydes and Ketones,
J. Phys. Chem., 1967, 71, 6, 1929, https://doi.org/10.1021/j100865a063
. [all data]
Zlatkis, Lee, et al., 1983
Zlatkis, A.; Lee, C.K.; Wentworth, W.E.; Chen, E.C.M.,
Constant current linearization for determination of electron capture mechanisms,
Anal. Chem., 1983, 55, 1596. [all data]
Fernandez, Jennings, et al., 1989
Fernandez, T.; Jennings, K.R.; Mason, R.S.,
Gas-phase proton transfer reactions in xylene-dimethyl ether mixtures,
J. Chem. Soc. Faraday Trans. 2, 1989, 85, 1813. [all data]
Klasinc, Kovac, et al., 1983
Klasinc, L.; Kovac, B.; Gusten, H.,
Photoelectron spectra of acenes. Electronic structure and substituent effects,
Pure Appl. Chem., 1983, 55, 289. [all data]
McLoughlin and Traeger, 1979
McLoughlin, R.G.; Traeger, J.C.,
A photoionization study of some benzoyl compounds - thermochemistry of [C7H5O]+ formation,
Org. Mass Spectrom., 1979, 14, 434. [all data]
Elder, Beynon, et al., 1976
Elder, J.F.; Beynon, J.H.; Cooks, R.G.,
The benzoyl ion. Thermochemistry and kinetic energy release,
Org. Mass Spectrom., 1976, 11, 415. [all data]
Behan, Johnstone, et al., 1976
Behan, J.M.; Johnstone, R.A.W.; Bentley, T.W.,
An evaluation of empirical methods for calculating the ionization potentials of substituted benzenes,
Org. Mass Spectrom., 1976, 11, 207. [all data]
Rabalais and Colton, 1973
Rabalais, J.W.; Colton, R.J.,
Electronic interaction between the phenyl group and its unsaturated substituents,
J. Electron Spectrosc. Relat. Phenom., 1973, 1, 83. [all data]
Benoit, 1973
Benoit, F.,
The benzoyl cation: The participation of isolated electronic excited states in the dissociation of molecular ions of the form [C6H5COX]+,
Org. Mass Spectrom., 1973, 7, 1407. [all data]
Iskakov and Potapov, 1971
Iskakov, L.I.; Potapov, V.K.,
Photionization and decomposition of benzaldehyde, acetophenone, and benzophenone,
High Energy Chem., 1971, 5, 238, In original 265. [all data]
Bock, Alt, et al., 1969
Bock, H.; Alt, H.; Seidl, H.,
d-Orbital effects in silicon-substituted π-electron systems. XV. The color of silyl ketones,
J. Am. Chem. Soc., 1969, 91, 355. [all data]
Watanabe, Nakayama, et al., 1962
Watanabe, K.; Nakayama, T.; Mottl, J.,
Ionization potentials of some molecules,
J. Quant. Spectry. Radiative Transfer, 1962, 2, 369. [all data]
Terenin, 1961
Terenin, A.,
Charge transfer in organic solids, induced by light,
Proc. Chem. Soc., London, 1961, 321. [all data]
Watanabe, 1957
Watanabe, K.,
Ionization potentials of some molecules,
J. Chem. Phys., 1957, 26, 542. [all data]
Vilesov and Terenin, 1957
Vilesov, F.I.; Terenin, A.N.,
The photoionization of the vapors of certain organic compounds,
Dokl. Akad. Nauk SSSR, 1957, 115, 744, In original 539. [all data]
Gal, Geribaldi, et al., 1985
Gal, J.-F.; Geribaldi, S.; Pfister-Guillouzo, G.; Morris, D.G.,
Basicity of the carbonyl group. Part 12. Correlations between ionization potentials and lewis basicities in aromatic carbonyl compounds,
J. Chem. Soc. Perkin Trans. 2, 1985, 103. [all data]
Benoit and Harrison, 1977
Benoit, F.M.; Harrison, A.G.,
Predictive value of proton affinity. Ionization energy correlations involving oxygenated molecules,
J. Am. Chem. Soc., 1977, 99, 3980. [all data]
Rao, 1975
Rao, C.N.R.,
Lone-pair ionization bands of chromophores in the photoelectron spectra of organic molecules,
Indian J. Chem., 1975, 13, 950. [all data]
Baker, May, et al., 1968
Baker, A.D.; May, D.P.; Turner, D.W.,
Molecular photoelectron spectroscopy. Part VII. The vertical ionisation potentials of benzene and some of its monosubstituted and 1,4-disubstituted derivatives,
J. Chem. Soc. B, 1968, 22. [all data]
Reed and Thornley, 1958
Reed, R.I.; Thornley, M.B.,
Studies in electron impact methods. Part 5. Acetaldehyde, acrolein, benzaldehyde, and propionaldehyde,
J. Chem. Soc. Faraday Trans., 1958, 54, 949. [all data]
Howe and Williams, 1969
Howe, I.; Williams, D.H.,
Calculation and qualitative predictions of mass spectra. Mono- and paradisubstituted benzenes,
J. Am. Chem. Soc., 1969, 91, 7137. [all data]