Benzyl alcohol
- Formula: C7H8O
- Molecular weight: 108.1378
- IUPAC Standard InChIKey: WVDDGKGOMKODPV-UHFFFAOYSA-N
- CAS Registry Number: 100-51-6
- Chemical structure:
View 3d structure (requires JavaScript / HTML 5) - Other names: Benzenemethanol; α-Hydroxytoluene; α-Toluenol; (Hydroxymethyl)benzene; Benzenecarbinol; Phenylcarbinol; Phenylmethanol; Phenylmethyl alcohol; Methanol, phenyl-; NCI-C06111; Hydroxytoluene; Bentalol; Benzoyl alcohol; Benzenmethanol; Benzylic alcohol; Methanol benzene; NSC 8044; Benzyl Alkohol

Gas phase thermochemistry data

Data compiled as indicated in comments:
ALS - Hussein Y. Afeefy, Joel F. Liebman, and Stephen E. Stein
DRB - Donald R. Burgess, Jr.
Quantity | Value | Units | Method | Reference | Comment |
---|---|---|---|---|---|
ΔfH°gas | -94.6 ± 3.0 | kJ/mol | Ccr | Papina, Pimenova, et al., 1995 | ALS |
ΔfH°gas | -100.7 | kJ/mol | N/A | Parks, Manchester, et al., 1954 | Value computed using ΔfHliquid° value of -161.0±1.3 kj/mol from Parks, Manchester, et al., 1954 and ΔvapH° value of 60.3 kj/mol from Papina, Pimenova, et al., 1995.; DRB |
ΔfH°gas | -113.7 | kJ/mol | N/A | Landrieu, Baylocq, et al., 1929 | Value computed using ΔfHliquid° value of -174.0 kj/mol from Landrieu, Baylocq, et al., 1929 and ΔvapH° value of 60.3 kj/mol from Papina, Pimenova, et al., 1995.; DRB |
ΔfH°gas | -106.7 | kJ/mol | N/A | Schmidlin, 1906 | Value computed using ΔfHliquid° value of -167.0 kj/mol from Schmidlin, 1906 and ΔvapH° value of 60.3 kj/mol from Papina, Pimenova, et al., 1995.; DRB |

Condensed phase thermochemistry data

Data compiled as indicated in comments:
ALS - Hussein Y. Afeefy, Joel F. Liebman, and Stephen E. Stein
DH - Eugene S. Domalski and Elizabeth D. Hearing
Quantity | Value | Units | Method | Reference | Comment |
---|---|---|---|---|---|
ΔfH°liquid | -154.9 ± 3.0 | kJ/mol | Ccr | Papina, Pimenova, et al., 1995 | ALS |
ΔfH°liquid | -161.0 ± 1.3 | kJ/mol | Ccb | Parks, Manchester, et al., 1954 | ALS |
ΔfH°liquid | -174. | kJ/mol | Ccb | Landrieu, Baylocq, et al., 1929 | ALS |
ΔfH°liquid | -167. | kJ/mol | Ccb | Schmidlin, 1906 | ALS |
Quantity | Value | Units | Method | Reference | Comment |
ΔcH°liquid | -3743.0 ± 2.8 | kJ/mol | Ccr | Papina, Pimenova, et al., 1995 | Corresponding ΔfHºliquid = -154.9 kJ/mol (simple calculation by NIST; no Washburn corrections); ALS |
ΔcH°liquid | -3736.9 | kJ/mol | Ccb | Parks, Manchester, et al., 1954 | Corresponding ΔfHºliquid = -161.0 kJ/mol (simple calculation by NIST; no Washburn corrections); ALS |
ΔcH°liquid | -3723. | kJ/mol | Ccb | Landrieu, Baylocq, et al., 1929 | Corresponding ΔfHºliquid = -174. kJ/mol (simple calculation by NIST; no Washburn corrections); ALS |
ΔcH°liquid | -3724. | kJ/mol | Ccb | Barker, 1925 | Author was aware that data differs from previously reported values; Corresponding ΔfHºliquid = -174. kJ/mol (simple calculation by NIST; no Washburn corrections); ALS |
ΔcH°liquid | -3731. | kJ/mol | Ccb | Schmidlin, 1906 | Corresponding ΔfHºliquid = -167. kJ/mol (simple calculation by NIST; no Washburn corrections); ALS |
Quantity | Value | Units | Method | Reference | Comment |
S°liquid | 216.7 | J/mol*K | N/A | Parks, Todd, et al., 1936 | Extrapolation below 90 K, 54.06 J/mol*K.; DH |
Constant pressure heat capacity of liquid
Cp,liquid (J/mol*K) | Temperature (K) | Reference | Comment |
---|---|---|---|
223.6 | 307.5 | Griigo'ev, Yanin, et al., 1979 | T = 307 to 461 K. p = 0.98 bar.; DH |
215.94 | 298.15 | Nichols and Wads, 1975 | DH |
217.86 | 298.1 | Parks, Todd, et al., 1936 | T = 90 to 300 K.; DH |
215.9 | 298.5 | Smith and Andrews, 1931 | T = 102 to 299 K. Value is unsmoothed experimental datum.; DH |
220.5 | 298. | von Reis, 1881 | T = 290 to 485 K.; DH |

Phase change data

Data compiled as indicated in comments:
BS - Robert L. Brown and Stephen E. Stein
TRC - Thermodynamics Research Center, NIST Boulder Laboratories, Chris Muzny director
AC - William E. Acree, Jr., James S. Chickos
DRB - Donald R. Burgess, Jr.
ALS - Hussein Y. Afeefy, Joel F. Liebman, and Stephen E. Stein
DH - Eugene S. Domalski and Elizabeth D. Hearing
Quantity | Value | Units | Method | Reference | Comment |
---|---|---|---|---|---|
Tboil | 478. ± 1. | K | AVG | N/A | Average of 16 out of 18 values; Individual data points |
Quantity | Value | Units | Method | Reference | Comment |
Tfus | 257. ± 2. | K | AVG | N/A | Average of 9 values; Individual data points |
Quantity | Value | Units | Method | Reference | Comment |
ΔvapH° | 63. ± 6. | kJ/mol | AVG | N/A | Average of 9 values; Individual data points |
Reduced pressure boiling point
Tboil (K) | Pressure (bar) | Reference | Comment |
---|---|---|---|
366.2 | 0.013 | Weast and Grasselli, 1989 | BS |
366. | 0.013 | Buckingham and Donaghy, 1982 | BS |
Enthalpy of vaporization
ΔvapH (kJ/mol) | Temperature (K) | Method | Reference | Comment |
---|---|---|---|---|
66.2 | 318. | GS | Grayson and Fosbraey, 2006 | Based on data from 303. to 333. K.; AC |
54.6 | 400. | A | Stephenson and Malanowski, 1987 | Based on data from 385. to 573. K. See also Kkykj and Repas, 1973.; AC |
61.5 | 303. | A.ME | Stephenson and Malanowski, 1987 | Based on data from 293. to 313. K. See also Serpinskii, Voitkevich, et al., 1957 and Kkykj and Repas, 1973.; AC |
Antoine Equation Parameters
log10(P) = A − (B / (T + C))
P = vapor pressure (bar)
T = temperature (K)
View plot Requires a JavaScript / HTML 5 canvas capable browser.
Temperature (K) | A | B | C | Reference | Comment |
---|---|---|---|---|---|
395.67 to 478.56 | 4.47713 | 1738.9 | -89.559 | Dreisbach and Shrader, 1949 | Coefficents calculated by NIST from author's data. |
Enthalpy of fusion
ΔfusH (kJ/mol) | Temperature (K) | Reference | Comment |
---|---|---|---|
8.79 | 257.6 | Acree, 1991 | AC |
8.970 | 257.6 | Parks, Todd, et al., 1936 | DH |
Entropy of fusion
ΔfusS (J/mol*K) | Temperature (K) | Reference | Comment |
---|---|---|---|
34.82 | 257.6 | Parks, Todd, et al., 1936 | DH |

Reaction thermochemistry data

Data compiled as indicated in comments:
B - John E. Bartmess
M - Michael M. Meot-Ner (Mautner) and Sharon G. Lias
ALS - Hussein Y. Afeefy, Joel F. Liebman, and Stephen E. Stein
Individual Reactions
By formula: C7H7O- + C7H8O = (C7H7O- • C7H8O)
Quantity | Value | Units | Method | Reference | Comment |
---|---|---|---|---|---|
ΔrH° | 125. ± 10. | kJ/mol | N/A | Caldwell, Rozeboom, et al., 1984 | gas phase; Reanchored to average data from Paul and Kebarle, 1990 and Meot-ner and Sieck, 1986.; value altered from reference due to change in acidity scale; B,M |
ΔrH° | 99.6 | kJ/mol | PHPMS | Caldwell and Kebarle, 1986 | gas phase; M |
Quantity | Value | Units | Method | Reference | Comment |
ΔrS° | 97.1 | J/mol*K | PHPMS | Caldwell and Kebarle, 1986 | gas phase; M |
ΔrS° | 123. | J/mol*K | N/A | Caldwell, Rozeboom, et al., 1984 | gas phase; switching reaction(CH3O-)CH3OH, Entropy change calculated or estimated; re-evaluated using Meot-Ner(Mautner), 1986 and Paul and Kebarle, 1990; M |
Quantity | Value | Units | Method | Reference | Comment |
ΔrG° | 86.6 ± 6.7 | kJ/mol | TDAs | Caldwell, Rozeboom, et al., 1984 | gas phase; Reanchored to average data from Paul and Kebarle, 1990 and Meot-ner and Sieck, 1986.; value altered from reference due to change in acidity scale; B,M |
By formula: C8H5- + C7H8O = (C8H5- • C7H8O)
Quantity | Value | Units | Method | Reference | Comment |
---|---|---|---|---|---|
ΔrH° | 111. ± 12. | kJ/mol | N/A | Caldwell, Rozeboom, et al., 1984 | gas phase; Reanchored to average data from Paul and Kebarle, 1990 and Meot-ner and Sieck, 1986.; value altered from reference due to change in acidity scale; B,M |
Quantity | Value | Units | Method | Reference | Comment |
ΔrS° | 123. | J/mol*K | N/A | Caldwell, Rozeboom, et al., 1984 | gas phase; switching reaction(CH3O-)CH3OH, Entropy change calculated or estimated; re-evaluated using Meot-Ner(Mautner), 1986 and Paul and Kebarle, 1990; M |
Quantity | Value | Units | Method | Reference | Comment |
ΔrG° | 74.9 ± 8.4 | kJ/mol | IMRE | Caldwell, Rozeboom, et al., 1984 | gas phase; Reanchored to average data from Paul and Kebarle, 1990 and Meot-ner and Sieck, 1986.; value altered from reference due to change in acidity scale; B,M |
C7H7O- + =
By formula: C7H7O- + H+ = C7H8O
Quantity | Value | Units | Method | Reference | Comment |
---|---|---|---|---|---|
ΔrH° | 1548. ± 8.8 | kJ/mol | G+TS | Bartmess, Scott, et al., 1979 | gas phase; value altered from reference due to change in acidity scale; B |
Quantity | Value | Units | Method | Reference | Comment |
ΔrG° | 1520. ± 8.4 | kJ/mol | IMRE | Bartmess, Scott, et al., 1979 | gas phase; value altered from reference due to change in acidity scale; B |
By formula: C5H5- + C7H8O = (C5H5- • C7H8O)
Quantity | Value | Units | Method | Reference | Comment |
---|---|---|---|---|---|
ΔrH° | 80.3 ± 4.2 | kJ/mol | TDAs | Meot-ner, 1988 | gas phase; B,M |
Quantity | Value | Units | Method | Reference | Comment |
ΔrS° | 125. | J/mol*K | PHPMS | Meot-ner, 1988 | gas phase; M |
Quantity | Value | Units | Method | Reference | Comment |
ΔrG° | 43.1 ± 4.2 | kJ/mol | TDAs | Meot-ner, 1988 | gas phase; B |
By formula: F- + C7H8O = (F- • C7H8O)
Quantity | Value | Units | Method | Reference | Comment |
---|---|---|---|---|---|
ΔrH° | 135.6 | kJ/mol | N/A | Mihalick, Gatev, et al., 1996 | gas phase; affinity derived using a ROH..F. neutral binding energy of 10.3 kcal/mol.; B |
By formula: C7H7I + H2O = HI + C7H8O
Quantity | Value | Units | Method | Reference | Comment |
---|---|---|---|---|---|
ΔrH° | -12.6 | kJ/mol | Cm | Gellner and Skinner, 1949 | liquid phase; Heat of hydrolysis; ALS |
By formula: C7H7Br + H2O = HBr + C7H8O
Quantity | Value | Units | Method | Reference | Comment |
---|---|---|---|---|---|
ΔrH° | -7.9 | kJ/mol | Cm | Gellner and Skinner, 1949 | liquid phase; Heat of hydrloysis; ALS |
By formula: C7H8O = C7H6O + H2
Quantity | Value | Units | Method | Reference | Comment |
---|---|---|---|---|---|
ΔrH° | 53.93 | kJ/mol | Eqk | Cubberley and Mueller, 1946 | gas phase; ALS |

Henry's Law data

Data compiled by: Rolf Sander
Henry's Law constant (water solution)
kH(T) = k°H exp(d(ln(kH))/d(1/T) ((1/T) - 1/(298.15 K)))
k°H = Henry's law constant for solubility in water at 298.15 K (mol/(kg*bar))
d(ln(kH))/d(1/T) = Temperature dependence constant (K)
k°H (mol/(kg*bar)) | d(ln(kH))/d(1/T) (K) | Method | Reference | Comment |
---|---|---|---|---|
9000. | E | N/A | Value obtained by missing citation using the group contribution method. |

Gas phase ion energetics data

Data evaluated as indicated in comments:
HL - Edward P. Hunter and Sharon G. Lias
Data compiled as indicated in comments:
B - John E. Bartmess
LBLHLM - Sharon G. Lias, John E. Bartmess, Joel F. Liebman, John L. Holmes, Rhoda D. Levin, and W. Gary Mallard
LLK - Sharon G. Lias, Rhoda D. Levin, and Sherif A. Kafafi
RDSH - Henry M. Rosenstock, Keith Draxl, Bruce W. Steiner, and John T. Herron
LL - Sharon G. Lias and Joel F. Liebman
Quantity | Value | Units | Method | Reference | Comment |
---|---|---|---|---|---|
Proton affinity (review) | 778.3 | kJ/mol | N/A | Hunter and Lias, 1998 | HL |
Quantity | Value | Units | Method | Reference | Comment |
Gas basicity | 748.0 | kJ/mol | N/A | Hunter and Lias, 1998 | HL |
Ionization energy determinations
IE (eV) | Method | Reference | Comment |
---|---|---|---|
8.26 ± 0.05 | EI | Selim, Rabbih, et al., 1987 | LBLHLM |
8.37 | EI | Russell, Freiser, et al., 1983 | LBLHLM |
9.0 ± 0.1 | EI | Gilbert, Leach, et al., 1973 | LLK |
9.14 ± 0.05 | EI | Pignataro, Foffani, et al., 1966 | RDSH |
9.23 | PE | Ballard, Jones, et al., 1987 | Vertical value; LBLHLM |
9.53 | PE | Deshmukh, Dutta, et al., 1982 | Vertical value; LBLHLM |
9.23 | PE | Eck, Schweig, et al., 1978 | Vertical value; LLK |
9.11 | PE | Benoit and Harrison, 1977 | Vertical value; LLK |
Appearance energy determinations
Ion | AE (eV) | Other Products | Method | Reference | Comment |
---|---|---|---|---|---|
C5H3+ | 15.49 ± 0.09 | OH+C2H4 | EI | Selim, Rabbih, et al., 1989 | LL |
C5H3+ | 16.86 ± 0.11 | H2O+H+C2H2 | EI | Selim, Rabbih, et al., 1989 | LL |
C6H7+ | 10.33 ± 0.06 | CHO | EI | Selim, Rabbih, et al., 1987, 2 | LBLHLM |
C6H7+ | 10.67 | CO+H | EI | Russell, Freiser, et al., 1983 | LBLHLM |
C6H7+ | 10.9 | CHO? | EI | Harrison, Haynes, et al., 1965 | RDSH |
C7H6+ | 11.71 ± 0.06 | H2O | EI | Selim, Rabbih, et al., 1987, 3 | LBLHLM |
C7H7+ | 11.76 ± 0.07 | OH | EI | Selim, Rabbih, et al., 1987, 2 | LBLHLM |
C7H7+ | 11.7 | OH | EI | Meyerson, Rylander, et al., 1959 | RDSH |
C7H7O+ | 10.46 ± 0.06 | H | EI | Selim, Rabbih, et al., 1987 | LBLHLM |
C7H7O+ | 10.03 | H | EI | Russell, Freiser, et al., 1983 | LBLHLM |
De-protonation reactions
C7H7O- + =
By formula: C7H7O- + H+ = C7H8O
Quantity | Value | Units | Method | Reference | Comment |
---|---|---|---|---|---|
ΔrH° | 1548. ± 8.8 | kJ/mol | G+TS | Bartmess, Scott, et al., 1979 | gas phase; value altered from reference due to change in acidity scale; B |
Quantity | Value | Units | Method | Reference | Comment |
ΔrG° | 1520. ± 8.4 | kJ/mol | IMRE | Bartmess, Scott, et al., 1979 | gas phase; value altered from reference due to change in acidity scale; B |

Ion clustering data

Data compiled as indicated in comments:
B - John E. Bartmess
M - Michael M. Meot-Ner (Mautner) and Sharon G. Lias
Clustering reactions
By formula: C5H5- + C7H8O = (C5H5- • C7H8O)
Quantity | Value | Units | Method | Reference | Comment |
---|---|---|---|---|---|
ΔrH° | 80.3 ± 4.2 | kJ/mol | TDAs | Meot-ner, 1988 | gas phase; B,M |
Quantity | Value | Units | Method | Reference | Comment |
ΔrS° | 125. | J/mol*K | PHPMS | Meot-ner, 1988 | gas phase; M |
Quantity | Value | Units | Method | Reference | Comment |
ΔrG° | 43.1 ± 4.2 | kJ/mol | TDAs | Meot-ner, 1988 | gas phase; B |
By formula: C7H7O- + C7H8O = (C7H7O- • C7H8O)
Quantity | Value | Units | Method | Reference | Comment |
---|---|---|---|---|---|
ΔrH° | 125. ± 10. | kJ/mol | N/A | Caldwell, Rozeboom, et al., 1984 | gas phase; Reanchored to average data from Paul and Kebarle, 1990 and Meot-ner and Sieck, 1986.; value altered from reference due to change in acidity scale; B,M |
ΔrH° | 99.6 | kJ/mol | PHPMS | Caldwell and Kebarle, 1986 | gas phase; M |
Quantity | Value | Units | Method | Reference | Comment |
ΔrS° | 97.1 | J/mol*K | PHPMS | Caldwell and Kebarle, 1986 | gas phase; M |
ΔrS° | 123. | J/mol*K | N/A | Caldwell, Rozeboom, et al., 1984 | gas phase; switching reaction(CH3O-)CH3OH, Entropy change calculated or estimated; re-evaluated using Meot-Ner(Mautner), 1986 and Paul and Kebarle, 1990; M |
Quantity | Value | Units | Method | Reference | Comment |
ΔrG° | 86.6 ± 6.7 | kJ/mol | TDAs | Caldwell, Rozeboom, et al., 1984 | gas phase; Reanchored to average data from Paul and Kebarle, 1990 and Meot-ner and Sieck, 1986.; value altered from reference due to change in acidity scale; B,M |
By formula: C8H5- + C7H8O = (C8H5- • C7H8O)
Quantity | Value | Units | Method | Reference | Comment |
---|---|---|---|---|---|
ΔrH° | 111. ± 12. | kJ/mol | N/A | Caldwell, Rozeboom, et al., 1984 | gas phase; Reanchored to average data from Paul and Kebarle, 1990 and Meot-ner and Sieck, 1986.; value altered from reference due to change in acidity scale; B,M |
Quantity | Value | Units | Method | Reference | Comment |
ΔrS° | 123. | J/mol*K | N/A | Caldwell, Rozeboom, et al., 1984 | gas phase; switching reaction(CH3O-)CH3OH, Entropy change calculated or estimated; re-evaluated using Meot-Ner(Mautner), 1986 and Paul and Kebarle, 1990; M |
Quantity | Value | Units | Method | Reference | Comment |
ΔrG° | 74.9 ± 8.4 | kJ/mol | IMRE | Caldwell, Rozeboom, et al., 1984 | gas phase; Reanchored to average data from Paul and Kebarle, 1990 and Meot-ner and Sieck, 1986.; value altered from reference due to change in acidity scale; B,M |
By formula: F- + C7H8O = (F- • C7H8O)
Quantity | Value | Units | Method | Reference | Comment |
---|---|---|---|---|---|
ΔrH° | 135.6 | kJ/mol | N/A | Mihalick, Gatev, et al., 1996 | gas phase; affinity derived using a ROH..F. neutral binding energy of 10.3 kcal/mol.; B |

Kovats' RI, non-polar column, isothermal

Column type | Active phase | Temperature (C) | I | Reference | Comment |
---|---|---|---|---|---|
Capillary | DB-1 | 170. | 1027.54 | Kuhn, 2001 | 30. m/0.53 mm/3. μm, He |
Capillary | SE-30 | 100. | 1007. | Tudor and Moldovan, 1999 | |
Capillary | SE-30 | 100. | 1006.8 | Tudor, 1997 | 40. m/0.35 mm/0.35 μm |
Capillary | OV-101 | 150. | 1005.3 | Cha and Lee, 1994 | Column length: 20. m; Column diameter: 0.5 mm |
Capillary | OV-101 | 180. | 1012.3 | Cha and Lee, 1994 | Column length: 20. m; Column diameter: 0.5 mm |
Capillary | SE-30 | 180. | 1014. | Korhonen, 1986 | N2; Column length: 25. m; Column diameter: 0.33 mm |
Capillary | SE-30 | 100. | 1009. | Korhonen, 1986 | N2; Column length: 25. m; Column diameter: 0.33 mm |
Capillary | SE-30 | 120. | 1014. | Korhonen, 1986 | N2; Column length: 25. m; Column diameter: 0.33 mm |
Capillary | SE-30 | 60. | 1009. | Korhonen, 1986 | N2; Column length: 25. m; Column diameter: 0.33 mm |
Capillary | SE-30 | 80. | 1009. | Korhonen, 1986 | N2; Column length: 25. m; Column diameter: 0.33 mm |
Packed | SE-30 | 150. | 1030. | Tiess, 1984 | Ar, Gas Chrom Q (80-100 mesh); Column length: 3. m |
Packed | SE-30 | 100. | 1017. | Winskowski, 1983 | Gaschrom Q; Column length: 2. m |
Packed | Apiezon L | 130. | 1010. | Wehrli and Kováts, 1959 | Celite; Column length: 2.25 m |

Kovats' RI, non-polar column, temperature ramp

Column type | Active phase | I | Reference | Comment |
---|---|---|---|---|
Capillary | CP Sil 8 CB | 1026. | Tayoub, Schwob, et al., 2006 | 30. m/0.25 mm/0.25 μm, H2, 50. C @ 2. min, 3. K/min; Tend: 220. C |
Capillary | CP Sil 8 CB | 1026. | Tayoub, Schwob, et al., 2006, 2 | 30. m/0.25 mm/0.25 μm, H2, 50. C @ 2. min, 3. K/min; Tend: 220. C |
Capillary | BP-1 | 1031. | Shawl, Srivastava, et al., 2002 | 30. m/0.32 mm/0.25 μm, N2, 5. K/min, 220. C @ 13. min; Tstart: 60. C |
Capillary | DB-1 | 1005. | Thangadurai, Anitha, et al., 2002 | 28. m/0.25 mm/0.25 μm, He, 50. C @ 1. min, 5.5 K/min; Tend: 270. C |
Capillary | OV-101 | 1007. | Morales and Duque, 1987 | He, 2. K/min; Column length: 25. m; Column diameter: 0.31 mm; Tstart: 60. C; Tend: 200. C |
Capillary | OV-101 | 1035. | Shibamoto, Kamiya, et al., 1981 | N2, 1. K/min; Column length: 80. m; Column diameter: 0.28 mm; Tstart: 80. C; Tend: 200. C |
Capillary | OV-101 | 1039. | Shibamoto, Kamiya, et al., 1981 | N2, 1. K/min; Column length: 80. m; Column diameter: 0.28 mm; Tstart: 80. C; Tend: 200. C |
Capillary | OV-101 | 1039. | Yamaguchi and Shibamoto, 1981 | N2, 2. K/min; Column length: 70. m; Column diameter: 0.28 mm; Tstart: 80. C; Tend: 200. C |
Capillary | OV-101 | 1046. | Yamaguchi and Shibamoto, 1981 | N2, 2. K/min; Column length: 70. m; Column diameter: 0.28 mm; Tstart: 80. C; Tend: 200. C |
Capillary | OV-101 | 1031. | Yamaguchi and Shibamoto, 1979 | N2, 2. K/min; Column length: 70. m; Column diameter: 0.28 mm; Tstart: 80. C; Tend: 200. C |
Capillary | OV-101 | 1033. | Yamaguchi and Shibamoto, 1979 | N2, 2. K/min; Column length: 70. m; Column diameter: 0.28 mm; Tstart: 80. C; Tend: 200. C |

Kovats' RI, non-polar column, custom temperature program

Column type | Active phase | I | Reference | Comment |
---|---|---|---|---|
Capillary | HP-5 | 1023.6 | Van Durme, Dewulf, et al., 2007 | Program: not specified |
Capillary | HP-1 | 1033. | Wongpornchai, Sriseadka, et al., 2003 | 30. m/0.25 mm/0.25 μm, He; Program: 35C => 2C/min => 100C => 5C/min => 230C(2min) |
Capillary | SPB-1 | 1022. | Borse, Jagan Mohan Rao, et al., 2002 | 30. m/0.32 mm/0.25 μm, He; Program: 40C(3min) => 2C/min => 100C => 4C/min => 220C (7min) |
Capillary | Methyl Silicone | 1022. | Bruce, Cork, et al., 2002 | Program: not specified |
Capillary | Methyl Silicone | 1022. | Bruce, Cork, et al., 2002 | Program: not specified |
Packed | SE-30 | 1046. | Ramsey, Lee, et al., 1980 | He, Chromosorb G HP (80-100 mesh); Column length: 1.5 m; Program: not specified |

Kovats' RI, polar column, isothermal

Column type | Active phase | Temperature (C) | I | Reference | Comment |
---|---|---|---|---|---|
Capillary | Carbowax 20M | 150. | 1895. | Tudor, Moldovan, et al., 1999 | Phase thickness: 0.45 μm |
Capillary | OV-351 | 100. | 1834. | Korhonen, 1986 | N2; Column length: 25. m; Column diameter: 0.33 mm |
Capillary | OV-351 | 120. | 1846. | Korhonen, 1986 | N2; Column length: 25. m; Column diameter: 0.33 mm |
Capillary | OV-351 | 140. | 1857. | Korhonen, 1986 | N2; Column length: 25. m; Column diameter: 0.33 mm |
Capillary | OV-351 | 160. | 1870. | Korhonen, 1986 | N2; Column length: 25. m; Column diameter: 0.33 mm |
Capillary | OV-351 | 180. | 1875. | Korhonen, 1986 | N2; Column length: 25. m; Column diameter: 0.33 mm |
Capillary | OV-351 | 200. | 1887. | Korhonen, 1986 | N2; Column length: 25. m; Column diameter: 0.33 mm |
Capillary | OV-351 | 180. | 1846. | Korhonen, 1986 | N2; Column length: 25. m; Column diameter: 0.32 mm |

Kovats' RI, polar column, temperature ramp

Column type | Active phase | I | Reference | Comment |
---|---|---|---|---|
Capillary | PE-Wax | 1861. | Chandravadana, Vekateshwarlu, et al., 2005 | N2, 60. C @ 4. min, 5. K/min, 200. C @ 5. min; Column length: 30. m; Column diameter: 0.25 mm |
Capillary | DB-Wax | 1877. | Nagarajan, Rao, et al., 2001 | 30. m/0.25 mm/0.25 μm, He, 60. C @ 5. min, 2. K/min, 220. C @ 5. min |
Capillary | PE-Wax | 1861. | Venkateshwarlu, Chandravadana, et al., 1999 | N2, 60. C @ 4. min, 5. K/min, 200. C @ 5. min; Column length: 30. m; Column diameter: 0.25 mm |
Capillary | Supelcowax-10 | 1880. | Wong and Teng, 1994 | He, 35. C @ 5. min, 3. K/min, 200. C @ 20. min; Column length: 60. m; Column diameter: 0.25 mm |
Capillary | DB-Wax | 1885. | Tatsuka, Suekane, et al., 1990 | 60. m/0.25 mm/0.25 μm, He, 40. C @ 5. min, 3. K/min; Tend: 200. C |
Capillary | DB-Wax | 1886. | Tatsuka, Suekane, et al., 1990 | 60. m/0.25 mm/0.25 μm, He, 40. C @ 5. min, 3. K/min; Tend: 200. C |
Capillary | Carbowax 20M | 1822. | Nishimura, Yamaguchi, et al., 1989 | 2. K/min; Column length: 50. m; Column diameter: 0.22 mm; Tstart: 80. C; Tend: 200. C |
Capillary | Carbowax 20M | 1834. | Gaydou, Randriamiharisoa, et al., 1986 | 50. m/0.3 mm/0.15 μm, H2, 2. K/min; Tstart: 70. C; Tend: 210. C |
Capillary | BP-20 | 1822. | MacLeod and Pieris, 1983 | H2, 65. C @ 3. min, 12. K/min; Column length: 25. m; Column diameter: 0.20 mm; Tend: 180. C |
Capillary | Carbowax 20M | 1822. | Toda, Mihara, et al., 1983 | 2. K/min; Column length: 50. m; Column diameter: 0.23 mm; Tstart: 80. C; Tend: 200. C |
Capillary | Carbowax 20M | 1823. | Toda, Mihara, et al., 1983 | 2. K/min; Column length: 50. m; Column diameter: 0.23 mm; Tstart: 80. C; Tend: 200. C |
Capillary | Carbowax 20M | 1830. | Buttery, Kamm, et al., 1982 | He, 50. C @ 30. min, 1. K/min; Column length: 150. m; Column diameter: 0.64 mm; Tend: 170. C |
Capillary | Carbowax 20M | 1830. | Buttery, Kamm, et al., 1982 | He, 50. C @ 30. min, 1. K/min; Column length: 150. m; Column diameter: 0.64 mm; Tend: 170. C |
Capillary | Carbowax 20M | 1821. | Shibamoto, Kamiya, et al., 1981 | N2, 2. K/min; Column length: 50. m; Column diameter: 0.28 mm; Tstart: 80. C; Tend: 200. C |
Capillary | Carbowax 20M | 1823. | Shibamoto, Kamiya, et al., 1981 | N2, 2. K/min; Column length: 50. m; Column diameter: 0.28 mm; Tstart: 80. C; Tend: 200. C |

Kovats' RI, polar column, custom temperature program

Column type | Active phase | I | Reference | Comment |
---|---|---|---|---|
Capillary | Polyethylene Glycol | 1887. | Bruce, Cork, et al., 2002 | Program: not specified |
Capillary | Polyethylene Glycol | 1888. | Bruce, Cork, et al., 2002 | Program: not specified |
Capillary | Carbowax 20M | 1875. | Brander, Kepner, et al., 1980 | Program: not specified |
Capillary | Carbowax 20M | 1879. | Brander, Kepner, et al., 1980 | Program: not specified |

Van Den Dool and Kratz RI, non-polar column, temperature ramp

Column type | Active phase | I | Reference | Comment |
---|---|---|---|---|
Capillary | SPB-5 | 1041. | Engel and Ratel, 2007 | 60. m/0.32 mm/1. μm, 40. C @ 2. min, 3. K/min, 230. C @ 10. min |
Capillary | DB-Petro | 1005.7 | Pang T., Zhu S., et al., 2007 | 50. m/0.2 mm/0.5 μm, 2. K/min; Tstart: 50. C; Tend: 270. C |
Capillary | DB-Petro | 1005.7 | Pang T., Zhu S., et al., 2007 | 50. m/0.2 mm/0.5 μm, 2. K/min; Tstart: 50. C; Tend: 270. C |
Capillary | HP-5MS | 1034.4 | Zeng, Zhao, et al., 2007 | 30. m/0.25 mm/0.25 μm, He, 4. K/min; Tstart: 80. C; Tend: 300. C |
Capillary | CP Sil 8 CB | 1029. | Mahadevan and Farmer, 2006 | 60. C @ 5. min, 4. K/min, 220. C @ 30. min; Column length: 50. m; Column diameter: 0.32 mm |
Capillary | DB-1 | 1053. | Osorio, Alarcon, et al., 2006 | 25. m/0.2 mm/0.33 μm, 4. K/min; Tstart: 50. C; Tend: 300. C |
Capillary | HP-5MS | 1020.3 | Zhao C.X., Li, et al., 2006 | 30. m/0.25 mm/0.25 μm, He, 4. K/min; Tstart: 80. C; Tend: 300. C |
Capillary | HP-5 | 1037. | Zhao, Wang X.Y., et al., 2006 | 30. m/0.25 mm/0.25 μm, He, 50. C @ 3. min, 10. K/min; Tend: 260. C |
Capillary | DB-5 | 1032. | Alves, Pinto, et al., 2005 | 30. m/0.25 mm/0.25 μm, H2, 5. K/min, 270. C @ 20. min; Tstart: 35. C |
Capillary | DB-1 | 1033. | bin Jantan, Yalvema, et al., 2005 | 25. m/0.25 mm/0.25 μm, 60. C @ 10. min, 3. K/min, 180. C @ 10. min |
Capillary | HP-5MS | 1033. | Pino, Mesa, et al., 2005 | 30. m/0.25 mm/0.25 μm, He, 60. C @ 2. min, 4. K/min, 250. C @ 20. min |
Capillary | HP-5MS | 1034.5 | Zhao, Liang, et al., 2005 | 30. m/0.25 mm/0.25 μm, He, 2. K/min; Tstart: 80. C; Tend: 290. C |
Capillary | HP-5MS | 1035.6 | Zhao, Liang, et al., 2005 | 30. m/0.25 mm/0.25 μm, He, 4. K/min; Tstart: 80. C; Tend: 290. C |
Capillary | HP-5MS | 1035.7 | Zhao, Liang, et al., 2005 | 30. m/0.25 mm/0.25 μm, He, 6. K/min; Tstart: 80. C; Tend: 290. C |
Capillary | BPX-5 | 1051. | Dickschat, Wenzel, et al., 2004 | 25. m/0.22 mm/0.25 μm, He, 50. C @ 5. min, 5. K/min; Tend: 300. C |
Capillary | SPB-5 | 1032. | Píno, Marbot, et al., 2004 | 30. m/0.25 mm/0.25 μm, He, 60. C @ 2. min, 4. K/min, 250. C @ 20. min |
Capillary | SPB-5 | 1035. | Pino, Marbot, et al., 2004 | 30. m/0.25 mm/0.25 μm, He, 60. C @ 2. min, 4. K/min, 250. C @ 20. min |
Capillary | SPB-5 | 1032. | Pino, Marbot, et al., 2004, 2 | 30. m/0.25 mm/0.25 μm, He, 60. C @ 2. min, 4. K/min, 250. C @ 20. min |
Capillary | BP-1 | 1037. | Raina, Kumar, et al., 2004 | 30. m/0.32 mm/0.25 μm, N2, 5. K/min, 220. C @ 13. min; Tstart: 60. C |
Capillary | DB-5 | 1032. | Reis, Pansarim, et al., 2004 | 30. m/0.25 mm/0.25 μm, He, 4. K/min; Tstart: 50. C; Tend: 290. C |
Capillary | HP-5 | 1041. | Siegmund and Murkovic, 2004 | 30. m/0.25 mm/0.1 μm, -30. C @ 1. min, 10. K/min, 250. C @ 5. min |
Capillary | HP-5 | 1034. | Singer, Flach, et al., 2004 | 30. m/0.25 mm/0.25 μm, He, 4. K/min; Tstart: 50. C; Tend: 310. C |
Capillary | HP-1 | 1000. | Cavalli, Fernandez, et al., 2003 | 50. m/0.2 mm/0.33 μm, He, 60. C @ 5. min, 2. K/min, 250. C @ 20. min |
Capillary | PE-5 | 1034. | Isidorov and Vinogorova, 2003 | He, 3. K/min; Column length: 30. m; Column diameter: 0.25 mm; Tstart: 40. C; Tend: 280. C |
Capillary | HP-5MS | 1035. | Lalel, Singh, et al., 2003 | 60. m/0.25 mm/0.25 μm, He, 40. C @ 1. min, 3. K/min, 310. C @ 20. min |
Capillary | CP Sil 5 CB | 1002. | Pino, Almora, et al., 2003 | 60. m/0.32 mm/0.25 μm, He, 60. C @ 10. min, 3. K/min, 280. C @ 60. min |
Capillary | SPB-5 | 1032. | Pino, Marbot, et al., 2002 | 30. m/0.25 mm/0.25 μm, He, 60. C @ 2. min, 4. K/min, 250. C @ 20. min |
Capillary | HP-5MS | 1042. | Kim, Shin, et al., 2001 | 30. m/0.25 mm/0.25 μm, He, 40. C @ 5. min, 2. K/min, 200. C @ 20. min |
Capillary | SPB-Sulfur | 1009.1 | de Lacy Costello, Evans, et al., 2001 | 30. m/0.32 mm/4. μm, 40. C @ 12.5 min, 4. K/min; Tend: 200. C |
Capillary | DB-5 | 1034. | Nogueira, Bittrich, et al., 2001 | 30. m/0.25 mm/0.25 μm, H2, 3. K/min; Tstart: 60. C; Tend: 240. C |
Capillary | SE-54 | 1039.08 | Yin, Xiu, et al., 2001 | 35. C @ 3. min, 4. K/min, 230. C @ 10. min; Column length: 25. m; Column diameter: 0.31 mm |
Capillary | SE-54 | 1039.31 | Yin, Xiu, et al., 2001 | 35. C @ 3. min, 4. K/min, 230. C @ 10. min; Column length: 25. m; Column diameter: 0.31 mm |
Capillary | HP-5 | 1037. | David, Scanlan, et al., 2000 | 50. m/0.32 mm/1.05 μm, He, 2. K/min; Tstart: 50. C; Tend: 290. C |
Capillary | DB-5MS | 1031. | Chassagne, Boulanger, et al., 1999 | 30. m/0.25 mm/0.25 μm, H2, 2. K/min; Tstart: 40. C; Tend: 200. C |
Capillary | SE-54 | 1036. | Li, Wang, et al., 1998 | H2, 35. C @ 3. min, 4. K/min; Column length: 25. m; Column diameter: 0.31 mm; Tend: 250. C |
Capillary | SE-54 | 1037. | Li, Wang, et al., 1998 | H2, 35. C @ 3. min, 4. K/min; Column length: 25. m; Column diameter: 0.31 mm; Tend: 250. C |
Capillary | DB-5 | 1033. | Sakho, Chassagne, et al., 1997 | H2, 60. C @ 3. min, 2. K/min; Column length: 30. m; Column diameter: 0.25 mm; Tend: 220. C |
Capillary | OV-1 | 1004.8 | Gautzsch and Zinn, 1996 | 8. K/min; Tstart: 35. C; Tend: 300. C |
Capillary | DB-1 | 1026. | Stashenko, Prada, et al., 1996 | 60. m/0.25 mm/0.25 μm, He, 50. C @ 5. min, 3.5 K/min; Tend: 250. C |
Capillary | DB-1 | 1007. | Coen, Engel, et al., 1995 | 30. m/0.32 mm/0.25 μm, N2, 3. K/min; Tstart: 150. C; Tend: 280. C |
Capillary | DB-1 | 1007. | Coen, Engel, et al., 1995 | 30. m/0.32 mm/0.25 μm, N2, 3. K/min; Tstart: 150. C; Tend: 280. C |
Capillary | DB-1 | 1047. | Adedeji, Hartman, et al., 1992 | 60. m/0.32 mm/0.25 μm, He, 40. C @ 3. min, 2. K/min, 280. C @ 10. min |
Capillary | OV-101 | 1007. | Yang, Sugisawa, et al., 1992 | N2, 2. K/min; Column length: 50. m; Column diameter: 0.25 mm; Tstart: 80. C; Tend: 200. C |
Capillary | OV-101 | 1007. | Yang, Sugisawa, et al., 1992 | N2, 2. K/min; Column length: 50. m; Column diameter: 0.25 mm; Tstart: 80. C; Tend: 200. C |
Capillary | SE-54 | 1027.2 | Shapi and Hesso, 1990 | 25. m/0.32 mm/0.15 μm, He, 40. C @ 1. min, 5. K/min, 280. C @ 15. min |
Capillary | SE-54 | 1027.2 | Shapi and Hesso, 1990 | 25. m/0.32 mm/0.15 μm, He, 40. C @ 1. min, 5. K/min, 280. C @ 15. min |
Capillary | DB-1 | 1003.9 | Chang, Sheng, et al., 1989 | 2. K/min; Column length: 30. m; Column diameter: 0.25 mm; Tstart: 50. C; Tend: 300. C |
Capillary | DB-1 | 1007.4 | Chang, Sheng, et al., 1989 | 2. K/min; Column length: 30. m; Column diameter: 0.25 mm; Tstart: 50. C; Tend: 300. C |
Capillary | BP-1 | 1002. | Tan, Wilkins, et al., 1989 | H2, 40. C @ 2. min, 4. K/min, 240. C @ 75. min; Column length: 12. m |
Capillary | DB-5 | 1033. | Guichard and Souty, 1988 | H2, 30. C @ 5. min, 1.5 K/min; Column length: 0.32 m; Column diameter: 1. mm; Tend: 180. C |
Capillary | SE-30 | 1005. | Korhonen, 1986 | N2, 6. K/min; Column length: 25. m; Column diameter: 0.33 mm; Tstart: 100. C |
Capillary | SE-30 | 1022. | Korhonen, 1986 | N2, 10. K/min; Column length: 25. m; Column diameter: 0.33 mm; Tstart: 50. C |
Capillary | OV-101 | 1040. | Misharina, Vitt, et al., 1986 | He, 40. C @ 4. min, 2. K/min; Column length: 50. m; Column diameter: 0.32 mm; Tend: 250. C |
Capillary | CP Sil 5 CB | 1010. | Halket and Schulten, 1985 | 26. m/0.32 mm/1.25 μm, 10. K/min; Tstart: 100. C; Tend: 250. C |
Capillary | CP Sil 5 CB | 1014. | Halket and Schulten, 1985 | 26. m/0.32 mm/1.25 μm, 10. K/min; Tstart: 100. C; Tend: 250. C |
Capillary | OV-1 | 1014. | Schreyen, Dirinck, et al., 1976 | 1. K/min; Column length: 183. m; Column diameter: 0.762 mm; Tstart: 0. C; Tend: 230. C |
Capillary | OV-1 | 1013. | Schreyen, Dirinck, et al., 1976, 2 | N2, 1. K/min; Column length: 183. m; Tstart: 0. C; Tend: 230. C |
Packed | SE-30 | 1020. | van den Dool and Kratz, 1963 | Celite; Tstart: 75. C; Tend: 228. C |

Van Den Dool and Kratz RI, non-polar column, custom temperature program

Column type | Active phase | I | Reference | Comment |
---|---|---|---|---|
Capillary | DB-5 | 1031. | Andrade, Sampaio, et al., 2007 | 30. m/0.25 mm/0.25 μm, He; Program: 40C(2min) => 4C/min => 220C => 20C/min => 280C |
Capillary | DB-5 | 1030. | Sampaio and Nogueira, 2006 | 30. m/0.25 mm/0.25 μm; Program: 40C(2min) => 4C/min => 220C => 20C/min => 280C |
Capillary | DB-5MS | 1057. | Varlet V., Knockaert C., et al., 2006 | 30. m/0.32 mm/0.5 μm, He; Program: 70C(1min) => 3C/min => 80C(1min) => 5C/min => 150C => 10C/min => 280C (4min) |
Capillary | DB-5MS | 1057. | Varlet V., Knockaert C., et al., 2006 | 30. m/0.32 mm/0.5 μm, He; Program: 70C(1min) => 3C/min => 80C(1min) => 5C/min => 150C => 10C/min => 280C (4min) |
Capillary | 5 % Phenyl methyl siloxane | 1035. | Sacchetti, Maietti, et al., 2005 | 30. m/0.32 mm/0.15 μm, He; Program: 45C => 1C/min => 100C => 5C/min => 250C (10min) |
Capillary | DB-5 | 1052. | Klesk, Qian, et al., 2004 | 30. m/0.32 mm/1. μm, He; Program: 40C (2min) => 5C/min => 100C => 4C/min => 230C (10min) |
Capillary | DB-5 | 1045. | Klesk and Qian, 2003 | 30. m/0.25 mm/0.25 μm, He; Program: 40C(2min) => 5C/min => 100C => 4C/min => 230C(10min) |
Capillary | DB-5 | 1033. | Beaulieu and Grimm, 2001 | 30. m/0.25 mm/0.25 μm, He; Program: 50C (1min) => 5C/min => 100C => 10C/min => 250C (9min) |
Capillary | DB-5MS | 1025. | Boulanger and Crouzet, 2001 | 30. m/0.25 mm/0.25 μm, H2; Program: 40C (5min) => 2C/min => 200C => 5C/min => 250C (15min) |
Capillary | DB-5MS | 1029. | Boulanger and Crouzet, 2001 | 30. m/0.25 mm/0.25 μm, H2; Program: 40C (5min) => 2C/min => 200C => 5C/min => 250C (15min) |
Capillary | DB-5MS | 1021. | Boulanger and Crouzet, 2000 | 30. m/0.25 mm/0.25 μm, He; Program: 60 0C (3 min) 2 K/min -> 220 0C 5 K/min -> 250 0C (15 min) |
Capillary | DB-5MS | 1033. | Boulanger and Crouzet, 2000, 2 | 30. m/0.25 mm/0.25 μm, H2/N2; Program: 40C (5min) => 2C/min => 200C => 5C/min => 250C (15min) |
Capillary | DB-5 | 1032. | Boulanger, Chassagne, et al., 1999 | 30. m/0.25 mm/0.25 μm, H2; Program: 40C(5min) => 2C/min => 220C => 5C/min => 250C(15min) |
Capillary | DB-5 | 1032. | Boulanger, Chassagne, et al., 1999 | 30. m/0.25 mm/0.25 μm, H2; Program: 40C(5min) => 2C/min => 220C => 5C/min => 250C(15min) |
Capillary | DB-5 | 1032. | Boulanger, Chassagne, et al., 1999 | 30. m/0.25 mm/0.25 μm, H2; Program: 40C(5min) => 2C/min => 220C => 5C/min => 250C(15min) |
Capillary | DB-5 | 1034. | Boulanger, Chassagne, et al., 1999 | 30. m/0.25 mm/0.25 μm, H2; Program: 40C(5min) => 2C/min => 220C => 5C/min => 250C(15min) |
Capillary | SE-54 | 1037. | Li, Wang, et al., 1998 | H2; Column length: 25. m; Column diameter: 0.31 mm; Program: not specified |
Capillary | 5 % Phenyl methyl siloxane | 1031. | Yasuhara, Shiraishi, et al., 1997 | 25. m/0.31 mm/0.52 μm, He; Program: 50C(2min) => (20C/min) => 120C => (7C/min) => 310C(10min) |
Capillary | SE-52 | 1037. | Mondello, Dugo, et al., 1995 | 60. m/0.32 mm/0.40 μm, He; Program: 45 C (6 min) 3 C/min -> 111 0C 2 C/min -> 160 C 3 C/min -> 300 C (15 min) |
Capillary | HP-1 | 1017. | Sing, Smadja, et al., 1992 | 50. m/0.32 mm/1.05 μm, He; Program: 20C(0.5min) => 60C => 4C/min => 250C |
Packed | SE-30 | 1031. | Peng, Ding, et al., 1988 | Supelcoport; Chromosorb; Column length: 3.05 m; Program: 40C(5min) => 10C/min => 200C or 250C (60min) |

Van Den Dool and Kratz RI, polar column, temperature ramp

Column type | Active phase | I | Reference | Comment |
---|---|---|---|---|
Capillary | DB-Wax Etr | 1880. | Aubert and Chanforan, 2007 | 30. m/0.25 mm/0.25 μm, 40. C @ 3. min, 5. K/min, 250. C @ 15. min |
Capillary | HP-20M | 1836. | Politeo, Jukic, et al., 2007 | 50. m/0.20 mm/0.20 μm, Helium, 70. C @ 4. min, 4. K/min, 180. C @ 15. min |
Capillary | DB-Wax | 1879. | Pozo-Bayon M.A., Ruiz-Rodriguez A., et al., 2007 | 30. m/0.25 mm/0.5 μm, He, 40. C @ 5. min, 4. K/min, 250. C @ 15. min |
Capillary | DB-Wax Etr | 1880. | Aubert C. and Pitrat M., 2006 | 30. m/0.25 mm/0.25 μm, He, 40. C @ 3. min, 5. K/min, 250. C @ 15. min |
Capillary | DB-Wax | 1884. | Cho, Choi, et al., 2006 | 60. m/0.25 mm/0.25 μm, He, 40. C @ 1. min, 4. K/min, 200. C @ 10. min |
Capillary | DB-Wax | 1904. | Gurbuz O., Rouseff J.M., et al., 2006 | 60. m/0.25 mm/0.25 μm, He, 7. K/min, 265. C @ 5. min; Tstart: 40. C |
Capillary | Innowax | 1889. | Lee, Lee, et al., 2006 | 60. m/0.25 mm/0.25 μm, He, 40. C @ 4. min, 4. K/min, 230. C @ 20. min |
Capillary | CP-Wax 52CB | 1864. | Mahadevan and Farmer, 2006 | 60. C @ 5. min, 4. K/min, 220. C @ 30. min; Column length: 50. m; Column diameter: 0.32 mm |
Capillary | DB-Wax | 1844. | Osorio, Alarcon, et al., 2006 | 30. m/0.25 mm/0.25 μm, He, 50. C @ 4. min, 4. K/min, 220. C @ 20. min |
Capillary | Supelcowax-10 | 1834. | Chung, Fung, et al., 2005 | 60. m/0.25 mm/0.25 μm, 35. C @ 5. min, 6. K/min, 195. C @ 60. min |
Capillary | Stabilwax | 1895. | Cros S., Lignot B., et al., 2005 | 60. m/0.25 mm/0.25 μm, He, 40. C @ 5. min, 3. K/min, 240. C @ 10. min |
Capillary | Stabilwax | 1886. | Cros, Lignot, et al., 2005 | 60. m/0.25 mm/0.25 μm, He, 40. C @ 5. min, 3. K/min, 240. C @ 10. min |
Capillary | Stabilwax | 1898. | Fang and Qian, 2005 | 30. m/0.32 mm/1. μm, N2, 40. C @ 2. min, 4. K/min, 230. C @ 10. min |
Capillary | Carbowax 20M | 1844. | Verzera, Campisi, et al., 2005 | 60. m/0.25 mm/0.25 μm, He, 45. C @ 0.17 min, 2. K/min; Tend: 250. C |
Capillary | DB-Wax | 1857. | Aubert and Bourger, 2004 | 30. m/0.25 mm/0.25 μm, H2, 40. C @ 3. min, 3. K/min, 250. C @ 20. min |
Capillary | ZB-Wax | 1881. | Ledauphin, Saint-Clair, et al., 2004 | 30. m/0.25 mm/0.15 μm, He, 35. C @ 10. min, 1.8 K/min, 220. C @ 10. min |
Capillary | DB-Wax Etr | 1854. | Ménager, Jost, et al., 2004 | 30. m/0.25 mm/0.25 μm, He, 40. C @ 3. min, 3. K/min, 245. C @ 20. min |
Capillary | DB-Wax | 1837. | Varming, Andersen, et al., 2004 | 30. m/0.25 mm/0.25 μm, He, 40. C @ 10. min, 6. K/min, 240. C @ 25. min |
Capillary | DB-Wax | 1866. | Varming, Petersen, et al., 2004 | 30. m/0.25 mm/0.25 μm, He, 40. C @ 10. min, 6. K/min, 240. C @ 25. min |
Capillary | DB-Wax | 1869. | Aubert, Ambid, et al., 2003 | 30. m/0.32 mm/0.5 μm, 40. C @ 3. min, 3. K/min, 245. C @ 20. min |
Capillary | DB-Wax | 1864. | Aubert, Günata, et al., 2003 | 30. m/0.32 mm/0.5 μm, 40. C @ 3. min, 2. K/min, 245. C @ 20. min |
Capillary | OV-351 | 1821. | Bonvehi and Coll, 2003 | 50. m/0.32 mm/0.2 μm, He, 5. K/min; Tstart: 60. C; Tend: 220. C |
Capillary | DB-Wax | 1866. | Chyau, Ko, et al., 2003 | 60. m/0.25 mm/0.25 μm, He, 2. K/min, 210. C @ 40. min; Tstart: 40. C |
Capillary | Stabilwax | 1886. | Cros, Vandanjon, et al., 2003 | 60. m/0.25 mm/0.25 μm, He, 40. C @ 5. min, 3. K/min, 240. C @ 10. min |
Capillary | HP-20M | 1823. | Jerkovic, Mastelic, et al., 2003 | 50. m/0.2 mm/0.2 μm, He, 70. C @ 4. min, 4. K/min, 180. C @ 10. min |
Capillary | AT-Wax | 1852. | Pino, Almora, et al., 2003 | 60. m/0.32 mm/0.25 μm, He, 65. C @ 10. min, 2. K/min, 250. C @ 60. min |
Capillary | Supelcowax-10 | 1876. | Chung, Yung, et al., 2002 | 60. m/0.25 mm/0.25 μm, He, 35. C @ 5. min, 2. K/min, 195. C @ 90. min |
Capillary | DB-Wax | 1902. | Claudela, Dirningera, et al., 2002 | 60. m/0.32 mm/0.5 μm, He, 2.7 K/min, 235. C @ 30. min; Tstart: 67. C |
Capillary | Supelcowax-10 | 1877. | Moreira, Trugo, et al., 2002 | 30. m/0.25 mm/0.25 μm, He, 3. K/min, 230. C @ 30. min; Tstart: 50. C |
Capillary | HP-Innowax | 1896. | Adamiec, Rossner, et al., 2001 | 30. m/0.25 mm/0.25 μm, N2, 5. K/min; Tstart: 60. C; Tend: 220. C |
Capillary | HP-Innowax | 1896. | Adamiec, Rossner, et al., 2001 | 30. m/0.25 mm/0.25 μm, N2, 5. K/min; Tstart: 60. C; Tend: 220. C |
Capillary | Supelcowax-10 | 1876. | Chung, Yung, et al., 2001 | 60. m/0.25 mm/0.25 μm, He, 35. C @ 5. min, 2. K/min, 195. C @ 90. min |
Capillary | DB-Wax | 1864. | Kim, Shin, et al., 2001 | 30. m/0.25 mm/0.25 μm, He, 40. C @ 5. min, 2. K/min, 200. C @ 20. min |
Capillary | DB-Wax | 1869. | Kim, 2001 | 60. m/0.25 mm/0.25 μm, He, 40. C @ 5. min, 2. K/min, 200. C @ 30. min |
Capillary | CP-Wax 52CB | 1844. | Verzera, Campisi, et al., 2001 | 60. m/0.25 mm/0.25 μm, He, 45. C @ 0.17 min, 2. K/min; Tend: 250. C |
Capillary | DB-Wax | 1864. | Wirth, Guo, et al., 2001 | 30. m/0.32 mm/0.5 μm, He, 60. C @ 3. min, 3. K/min, 245. C @ 20. min |
Capillary | DB-Wax | 1870. | Bureau, Baumes, et al., 2000 | 30. m/0.32 mm/0.5 μm, He, 60. C @ 3. min, 3. K/min, 245. C @ 20. min |
Capillary | DB-Wax | 1870. | Bureau, Razungles, et al., 2000 | 30. m/0.32 mm/0.5 μm, 60. C @ 3. min, 3. K/min, 245. C @ 20. min |
Capillary | DB-FFAP | 1883. | Charles, Martin, et al., 2000 | 30. m/0.32 mm/0.25 μm, H2, 40. C @ 2. min, 5. K/min; Tend: 240. C |
Capillary | Supelcowax-10 | 1882. | Chung, 2000 | 60. m/0.25 mm/0.25 μm, He, 2. K/min, 195. C @ 90. min; Tstart: 35. C |
Capillary | DB-Wax | 1860. | Chassagne, Boulanger, et al., 1999 | 30. m/0.25 mm/0.25 μm, H2, 60. C @ 3. min, 2. K/min; Tend: 220. C |
Capillary | HP-Innowax | 1890. | Christensen, Jakobsen, et al., 1999 | He, 32. C @ 1. min, 2. K/min, 220. C @ 40. min; Column length: 60. m; Column diameter: 0.25 mm |
Capillary | Supelcowax-10 | 1882. | Chung, 1999 | 60. m/0.25 mm/0.25 μm, He, 35. C @ 5. min, 2. K/min, 195. C @ 90. min |
Capillary | Supelcowax-10 | 1882. | Chung, 1999, 2 | 60. m/0.25 mm/0.25 μm, He, 35. C @ 5. min, 2. K/min, 195. C @ 90. min |
Capillary | PEG-20M | 1825. | Li, Wang, et al., 1998 | H2, 50. C @ 3. min, 2. K/min; Column length: 25. m; Column diameter: 0.20 mm; Tend: 230. C |
Capillary | PEG-20M | 1826. | Li, Wang, et al., 1998 | H2, 50. C @ 3. min, 2. K/min; Column length: 25. m; Column diameter: 0.20 mm; Tend: 230. C |
Capillary | DB-Wax | 1828. | Ollé, Baumes, et al., 1998 | 30. m/0.32 mm/0.5 μm, 40. C @ 3. min, 3. K/min, 245. C @ 20. min |
Capillary | DB-Wax | 1828. | Ollé, Baumes, et al., 1998 | 30. m/0.32 mm/0.5 μm, 40. C @ 3. min, 3. K/min, 245. C @ 20. min |
Capillary | HP-Wax | 1907. | Christensen, Jakobsen, et al., 1997 | 50. m/0.2 mm/0.4 μm, He, 30. C @ 1. min, 5. K/min, 220. C @ 30. min |
Capillary | DB-Wax | 1893. | Mau and Hwang, 1997 | 30. m/0.53 mm/0.25 μm, N2, 2. K/min; Tstart: 50. C; Tend: 200. C |
Capillary | PEG-20M | 1868. | Shimoda, Nakada, et al., 1997 | 60. m/0.25 mm/0.25 μm, He, 2. K/min, 230. C @ 60. min; Tstart: 50. C |
Capillary | DB-Wax | 1868. | Shimoda, Shiratsuchi, et al., 1996 | 60. m/0.25 mm/0.25 μm, He, 2. K/min, 230. C @ 60. min; Tstart: 50. C |
Capillary | DB-Wax | 1886. | Shimoda, Wu, et al., 1996 | 60. m/0.25 mm/0.25 μm, He, 3. K/min; Tstart: 50. C; Tend: 230. C |
Capillary | DB-Wax | 1875. | Stashenko, Prada, et al., 1996 | 60. m/0.25 mm/0.25 μm, He, 50. C @ 5. min, 2.5 K/min; Tend: 180. C |
Capillary | DB-Wax | 1885. | Coen, Engel, et al., 1995 | 30. m/0.32 mm/0.5 μm, He, 2. K/min; Tstart: 50. C; Tend: 230. C |
Capillary | DB-Wax | 1885. | Coen, Engel, et al., 1995 | 30. m/0.32 mm/0.5 μm, He, 2. K/min; Tstart: 50. C; Tend: 230. C |
Capillary | Carbowax 20M | 1849. | Mondello, Dugo, et al., 1995 | 60. m/0.32 mm/0.425 μm, He, 45. C @ 3. min, 3. K/min, 300. C @ 20. min |
Capillary | DB-Wax | 1870. | Shimoda, Shigematsu, et al., 1995 | 60. m/0.25 mm/0.25 μm, 2. K/min; Tstart: 50. C; Tend: 230. C |
Capillary | DB-Wax | 1870. | Shimoda, Shigematsu, et al., 1995, 2 | 60. m/0.25 mm/0.25 μm, He, 2. K/min; Tstart: 50. C; Tend: 230. C |
Capillary | DB-Wax | 1867. | Iwaoka, Hagi, et al., 1994 | He, 40. C @ 5. min, 2. K/min; Column length: 30. m; Column diameter: 0.25 mm; Tend: 200. C |
Capillary | HP-20M | 1837. | Chung, Eiserich, et al., 1993 | He, 3. K/min; Column length: 50. m; Column diameter: 0.25 mm; Tstart: 60. C; Tend: 190. C |
Capillary | DB-Wax | 1868. | Umano, Hagi, et al., 1992 | He, 40. C @ 10. min, 2. K/min; Column length: 30. m; Column diameter: 0.25 mm; Tend: 200. C |
Capillary | DB-Wax | 1852. | Humpf and Schreier, 1991 | 30. m/0.25 mm/0.25 μm, He, 50. C @ 3. min, 4. K/min, 220. C @ 20. min |
Capillary | DB-Wax | 1864. | Krammer, Winterhalter, et al., 1991 | 30. m/0.25 mm/0.25 μm, He, 50. C @ 3. min, 4. K/min; Tend: 240. C |
Capillary | CP-Wax 58CB | 1841. | Pabst, Barron, et al., 1991 | 30. m/0.25 mm/0.22 μm, He, 3. K/min; Tstart: 40. C; Tend: 220. C |
Capillary | DB-Wax | 1846. | Suárez, Duque, et al., 1991 | 30. m/0.259 mm/0.25 μm, He, 50. C @ 3. min, 4. K/min; Tend: 240. C |
Capillary | DB-Wax | 1853. | Suárez, Duque, et al., 1991 | 30. m/0.259 mm/0.25 μm, He, 50. C @ 3. min, 4. K/min; Tend: 240. C |
Capillary | DB-Wax | 1846. | Suárez, Duque, et al., 1991 | 30. m/0.259 mm/0.25 μm, He, 50. C @ 3. min, 4. K/min; Tend: 240. C |
Capillary | DB-Wax | 1853. | Suárez, Duque, et al., 1991 | 30. m/0.259 mm/0.25 μm, He, 50. C @ 3. min, 4. K/min; Tend: 240. C |
Capillary | DB-Wax | 1864. | Frohlich and Schreier, 1990 | 30. m/0.32 mm/0.25 μm, He, 40. C @ 3. min, 5. K/min; Tend: 220. C |
Capillary | DB-Wax | 1872.3 | Chang, Sheng, et al., 1989 | 2. K/min; Column length: 30. m; Column diameter: 0.25 mm; Tstart: 50. C; Tend: 240. C |
Capillary | DB-Wax | 1876.0 | Chang, Sheng, et al., 1989 | 2. K/min; Column length: 30. m; Column diameter: 0.25 mm; Tstart: 50. C; Tend: 240. C |
Capillary | DB-Wax | 1864. | Fröhlich, Duque, et al., 1989 | 30. m/0.25 mm/0.25 μm, He, 50. C @ 3. min, 4. K/min; Tend: 250. C |
Capillary | DB-Wax | 1867. | Fröhlich, Duque, et al., 1989 | 30. m/0.25 mm/0.25 μm, He, 50. C @ 3. min, 4. K/min; Tend: 250. C |
Capillary | Carbowax 20M | 1848. | Schwab, Mahr, et al., 1989 | 30. m/0.25 mm/0.25 μm, He, 40. C @ 3. min, 4. K/min; Tend: 240. C |
Capillary | CP-WAX 57CB | 1867. | Baltes and Mevissen, 1988 | He, 50. C @ 5. min, 2. K/min; Column length: 50. m; Column diameter: 0.24 mm; Tend: 210. C |
Capillary | Carbowax 20M | 1862. | Chen, Kuo, et al., 1986 | He, 50. C @ 5. min, 2. K/min, 200. C @ 40. min; Column length: 50. m; Column diameter: 0.32 mm |
Capillary | OV-351 | 1837. | Korhonen, 1986 | N2, 6. K/min; Column length: 25. m; Column diameter: 0.33 mm; Tstart: 100. C; Tend: 220. C |
Capillary | OV-351 | 1835. | Korhonen, 1986 | N2, 10. K/min; Column length: 25. m; Column diameter: 0.33 mm; Tstart: 50. C; Tend: 220. C |
Packed | Carbowax 20M | 1859. | van den Dool and Kratz, 1963 | Celite 545, 4.6 K/min; Tstart: 75. C; Tend: 228. C |

Van Den Dool and Kratz RI, polar column, custom temperature program

Column type | Active phase | I | Reference | Comment |
---|---|---|---|---|
Capillary | CP-Wax 52CB | 1874. | Romeo, Ziino, et al., 2007 | 60. m/0.25 mm/0.25 μm, He; Program: 45C(5min) => 10C/min => 80C => 2C/min => 240C |
Capillary | FFAP | 1871. | Frauendorfer and Schieberle, 2006 | 25. m/0.32 mm/0.2 μm, He; Program: 40C(1min) => 40C/min => 60C(1min) => 6C/min => 180C => 15C/min => 240C |
Capillary | DB-Wax | 1866. | Guillot, Peytavi, et al., 2006 | 30. m/0.25 mm/0.25 μm, He; Program: 60C => 5C/min => 200C => 6C/min => 250C(5min) |
Capillary | DB-Wax | 1869. | Selli, Canbas, et al., 2006 | 30. m/0.32 mm/0.5 μm, H2; Program: 60C(3min) => 2C/min => 220C => 3C/min => 245C (20min) |
Capillary | DB-Wax | 1869. | Selli, Canbas, et al., 2006, 2 | 30. m/0.32 mm/0.5 μm, H2; Program: 60C(3min) => 2C/min => 220C => 3C/min => 245C(20min) |
Capillary | SOLGel-Wax | 1837. | Aubert, Baumann, et al., 2005 | 30. m/0.25 mm/0.25 μm, He; Program: 35C(5min) => 3C/min => 150C => 5C/min => 250C(10 min) |
Capillary | SOLGel-Wax | 1837. | Aubert, Baumann, et al., 2005 | 30. m/0.25 mm/0.25 μm, He; Program: 35C(5min) => 3C/min => 150C => 5C/min => 250C (10min) |
Capillary | SOLGel-Wax | 1837. | Aubert, Baumann, et al., 2005 | 30. m/0.25 mm/0.25 μm, He; Program: 35C(5min) => 3C/min => 150C => 5C/min => 250C (10min) |
Capillary | SOLGel-Wax | 1837. | Aubert, Baumann, et al., 2005 | 30. m/0.25 mm/0.25 μm, He; Program: 35C(5min) => 3C/min => 150C => 5C/min => 250C (10min) |
Capillary | Stabilwax | 1890. | Wang, Finn, et al., 2005 | 30. m/0.32 mm/1. μm, He; Program: 40C(2min) => 5C/min => 100C => 4C/min => 230C (10min) |
Capillary | Stabilwax | 1915. | Wang, Finn, et al., 2005 | 30. m/0.32 mm/1. μm, He; Program: 40C(2min) => 5C/min => 100C => 4C/min => 230C (10min) |
Capillary | DB-Wax | 1868. | Ferrari, Lablanquie, et al., 2004 | 60. m/0.25 mm/0.25 μm, He; Program: 35C(0.7min) => 20C/min => 70C => 4C/min => 240C |
Capillary | Stabilwax | 1898. | Klesk, Qian, et al., 2004 | 30. m/0.32 mm/1. μm, He; Program: 40C (2min) => 5C/min => 100C => 4C/min => 230C (10min) |
Capillary | DB-Wax | 1869. | Selli, Cabaroglu, et al., 2004 | 30. m/0.32 mm/0.5 μm, H2; Program: 60C(3min) => 2C/min => 220C => 3C/min => 245C (20min) |
Capillary | Carbowax 20M | 1882. | Boido, Lloret, et al., 2003 | 25. m/0.32 mm/0.25 μm, H2; Program: 40C (8min) => 3C/min => 180C => 20C/min => 230C |
Capillary | Carbowax 20M | 1882. | Boido, Lloret, et al., 2003 | 25. m/0.32 mm/0.25 μm, H2; Program: 40C (8min) => 3C/min => 180C => 20C/min => 230C |
Capillary | DB-FFAP | 1875. | Huynh-Ba, Matthey-Doret, et al., 2003 | 30. m/0.32 mm/0.25 μm; Program: 35C(2min) => 6C/min => 180C => 10C/min => 240C (10min) |
Capillary | Stabilwax | 1905. | Klesk and Qian, 2003 | 30. m/0.32 mm/1. μm, He; Program: 40C(2min) => 5C/min => 100C => 4C/min => 230C(10min) |
Capillary | Supelcowax-10 | 1861. | da Porto, Pizzale, et al., 2003 | 30. m/0.32 mm/0.3 μm; Program: 60C(8min) => 8C/min => 170C => 13C/min => 240C(20min) |
Capillary | DB-Wax | 1865. | Nurgel, Erten, et al., 2002 | 30. m/0.32 mm/0.5 μm, H2; Program: 60C (3min) => 2C/min => 220C => 3C/min => 245C (20min) |
Capillary | DB-Wax | 1861. | Boulanger and Crouzet, 2001 | 30. m/0.25 mm/0.25 μm, H2; Program: 60C (3min) => 2C/min => 220C => 5C/min => 250C (15min) |
Capillary | DB-Wax | 1856. | Boulanger and Crouzet, 2001 | 30. m/0.25 mm/0.25 μm, H2; Program: 60C (3min) => 2C/min => 220C => 5C/min => 250C (15min) |
Capillary | DB-Wax | 1858. | Cantergiani, Brevard, et al., 2001 | 30. m/0.25 mm/0.25 μm; Program: 20C(30s) => fast => 60C => 4C/min => 220C (20min) |
Capillary | DB-Wax | 1871. | Ziegleder, 2001 | He; Column length: 60. m; Column diameter: 0.25 mm; Program: 45C(4min) => 30C/min => 60C (5min) => 3C/min => 220C (40min) |
Capillary | DB-Wax | 1851. | Boulanger and Crouzet, 2000 | 30. m/0.25 mm/0.25 μm, H2; Program: 60 0C (3 min) 2 K/min -> 220 0C 5 K/min -> 250 0C (15 min) |
Capillary | DB-Wax | 1851. | Boulanger and Crouzet, 2000, 2 | 30. m/0.25 mm/0.25 μm, H2; Program: 60C(3min) => 2C/min => 220C => 5C/min => 250C (15min) |
Capillary | HP-Innowax | 1880. | Bisio, Ciarallo, et al., 1998 | 30. m/0.25 mm/0.25 μm, He; Program: 60C(8min) => 3C/min => 180C(5min) => 40C/min => 250C |
Capillary | DB-Wax | 1894. | Prost, Serot, et al., 1998 | 30. m/0.32 mm/0.5 μm; Program: 50C => 3C/min => 180C => 5C/min => 250C (15min) |
Capillary | DB-Wax | 1896. | Prost, Serot, et al., 1998 | 30. m/0.32 mm/0.5 μm; Program: 50C => 3C/min => 180C => 5C/min => 250C (15min) |
Capillary | Supelcowax-10 | 1883. | Sing, Smadja, et al., 1992 | 60. m/0.25 mm/0.25 μm, He; Program: 20C(0.5min) => 60C => 4C/min => 250C |
Capillary | Carbowax 20M | 1865. | Whitfield, Shea, et al., 1981 | Column length: 150. m; Column diameter: 0.75 mm; Program: not specified |

Normal alkane RI, non-polar column, temperature ramp

Column type | Active phase | I | Reference | Comment |
---|---|---|---|---|
Capillary | HP-5 MS | 1035. | Nawrath, Mgode, et al., 2012 | 30. m/0.25 mm/0.25 μm, Helium, 50. C @ 5. min, 5. K/min; Tend: 320. C |
Capillary | CP-Sil 5 CB | 1028. | Ameen, Usman, et al., 2011 | 25. m/0.25 mm/0.15 μm, Helium; Tstart: 50. C; Tend: 220. C |
Capillary | HP-5 MS | 1042. | Hammami, Kamoun, et al., 2011 | 30. m/0.25 mm/0.25 μm, Helium, 2. K/min; Tstart: 50. C; Tend: 180. C |
Capillary | VF-5 MS | 1037. | Leffingwell and Alford, 2011 | 60. m/0.32 mm/0.25 μm, Helium, 2. K/min, 260. C @ 28. min; Tstart: 30. C |
Capillary | VF-5 MS | 1040. | Leffingwell and Alford, 2011 | 60. m/0.32 mm/0.25 μm, Helium, 2. K/min, 260. C @ 28. min; Tstart: 30. C |
Capillary | HP-5 MS | 1039. | Miyazawa, Marumoto, et al., 2011 | 30. m/0.25 mm/0.25 μm, Helium, 4. K/min, 260. C @ 5. min; Tstart: 40. C |
Capillary | DB-5 | 1031. | Jardim, Jham, et al., 2010 | 30. m/0.25 mm/0.25 μm, Nitrogen, 60. C @ 1. min, 3. K/min, 240. C @ 9. min |
Capillary | HP-5 MS | 1037. | Jerkovic, Hegic, et al., 2010 | 30. m/0.25 mm/0.25 μm, Helium, 70. C @ 2. min, 3. K/min, 200. C @ 18. min |
Capillary | HP-5 MS | 1037. | Jerkovic and Marijanovic, 2010 | 30. m/0.25 mm/0.25 μm, Helium, 70. C @ 2. min, 3. K/min, 200. C @ 18. min |
Capillary | HP-5 MS | 1037. | Jerkovic, Tuberso, et al., 2010 | 30. m/0.25 mm/0.25 μm, Helium, 70. C @ 2. min, 3. K/min, 200. C @ 18. min |
Capillary | HP-5 MS | 1033. | Pino, Marquez, et al., 2010 | 30. m/0.32 mm/0.25 μm, Helium, 50. C @ 2. min, 4. K/min, 240. C @ 10. min |
Capillary | HP-5 MS | 1036. | Radulovic, Blagojevic, et al., 2010 | 30. m/0.25 mm/0.25 μm, Helium, 5. K/min, 290. C @ 10. min; Tstart: 70. C |
Capillary | HP-5 MS | 1034. | Radulovic, Dordevic, et al., 2010 | 30. m/0.25 mm/0.25 μm, Helium, 5. K/min, 290. C @ 10. min; Tstart: 70. C |
Capillary | CP Sil 5 CB | 1028. | Usman, Zubair, et al., 2010 | 25. m/0.25 mm/0.15 μm, 3. K/min; Tstart: 50. C; Tend: 230. C |
Capillary | HP-5 MS | 1032. | Kim and Chung, 2009 | 30. m/0.25 mm/0.25 μm, Helium, 35. C @ 5. min, 2. K/min, 195. C @ 30. min |
Capillary | HP-5 MS | 1037. | Radulovic, Blagojevic, et al., 2009 | 30. m/0.25 mm/0.25 μm, Helium, 5. K/min, 290. C @ 10. min; Tstart: 70. C |
Capillary | Mega 5 MS | 1039. | Romeo, Verzera, et al., 2009 | 60. m/0.25 mm/0.25 μm, Helium, 40. C @ 2. min, 3. K/min; Tend: 240. C |
Capillary | BPX-5 | 1053. | Bieri and Marriott, 2008 | 30. m/0.25 mm/0.25 μm, Hydrogen, 3. K/min; Tstart: 100. C; Tend: 999. C |
Capillary | BPX-5 | 1048. | Bieri and Marriott, 2008 | 30. m/0.25 mm/0.25 μm, Hydrogen, 3. K/min; Tstart: 60. C; Tend: 999. C |
Capillary | BPX-5 | 1049. | Bieri and Marriott, 2008 | 30. m/0.25 mm/0.25 μm, Hydrogen, 3. K/min; Tstart: 60. C; Tend: 999. C |
Capillary | BPX-5 | 1050. | Bieri and Marriott, 2008 | 30. m/0.25 mm/0.25 μm, Hydrogen, 3. K/min; Tstart: 60. C; Tend: 999. C |
Capillary | BPX-5 | 1065. | Bieri and Marriott, 2008 | 30. m/0.25 mm/0.25 μm, Hydrogen, 3. K/min; Tstart: 60. C; Tend: 999. C |
Capillary | BPX-5 | 1051. | Bieri and Marriott, 2008 | 30. m/0.25 mm/0.25 μm, Hydrogen, 5. K/min; Tstart: 60. C; Tend: 999. C |
Capillary | SPB-1 | 1015. | Frerot, Velluz, et al., 2008 | 30. m/0.25 mm/1.0 μm, Helium, 60. C @ 5. min, 5. K/min; Tend: 250. C |
Capillary | DB-5 | 1033. | Jardin, Jham, et al., 2008 | 30. m/0.25 mm/0.25 μm, Nitrogen, 60. C @ 1. min, 3. K/min, 240. C @ 9. min |
Capillary | Equity-5 MS | 1040. | Mondello, Casilli, et al., 2008 | 30. m/0.25 mm/0.25 μm, Helium, 1.5 K/min; Tstart: 40. C; Tend: 260. C |
Capillary | HP-5MS | 1033. | Calyecac-cortero, Cibrian-Tovar, et al., 2007 | 30. m/0.32 mm/0.25 μm, N2, 50. C @ 1. min, 1. K/min; Tend: 200. C |
Capillary | RTX-5 MS | 1043. | Edris, Chizzola, et al., 2007 | 30. m/0.25 mm/0.25 μm, He, 60. C @ 2. min, 2. K/min, 200. C @ 10. min |
Capillary | ZP-5 | 1050. | Füssel, Dötterl, et al., 2007 | 60. m/0.25 mm/0.25 μm, He, 40. C @ 7. min, 6. K/min, 260. C @ 1. min |
Capillary | ZB-5 | 1031. | Mohottalage, Tabacchi, et al., 2007 | 30. m/0.25 mm/0.25 μm, 60. C @ 5. min, 4. K/min, 220. C @ 20. min |
Capillary | Elite-5MS | 1034. | Tava, Pecetti, et al., 2007 | 30. m/0.32 mm/0.5 μm, He, 40. C @ 5. min, 4. K/min, 280. C @ 10. min |
Capillary | DB-5 | 1040. | Xu, Fan, et al., 2007 | 30. m/0.32 mm/0.25 μm, He, 40. C @ 2. min, 4. K/min, 250. C @ 5. min |
Capillary | HP-1 | 1006. | Castel, Fernandez, et al., 2006 | 50. m/0.2 mm/0.33 μm, He, 60. C @ 4. min, 2. K/min, 250. C @ 30. min |
Capillary | HP-1 | 1004. | Castel, Fernandez, et al., 2006 | 50. m/0.2 mm/0.33 μm, He, 60. C @ 4. min, 2. K/min, 250. C @ 30. min |
Capillary | HP-1 | 1006. | Castel, Fernandez, et al., 2006 | 50. m/0.2 mm/0.33 μm, He, 60. C @ 4. min, 2. K/min, 250. C @ 30. min |
Capillary | HP-1 | 1009. | Castel, Fernandez, et al., 2006, 2 | 50. m/0.2 mm/0.5 μm, He, 2. K/min, 250. C @ 120. min; Tstart: 60. C |
Capillary | HP-1 | 1004. | Castel, Fernandez, et al., 2006, 2 | 50. m/0.2 mm/0.33 μm, He, 60. C @ 4. min, 2. K/min, 250. C @ 30. min |
Capillary | DB-5 | 1028. | Fadel, Mageed, et al., 2006 | He, 50. C @ 5. min, 4. K/min; Column length: 60. m; Column diameter: 0.32 mm; Tend: 250. C |
Capillary | DB-5 | 1034. | Pino, Marbot, et al., 2006 | 30. m/0.25 mm/0.25 μm, Hydrogen, 70. C @ 4. min, 4. K/min; Tend: 280. C |
Capillary | Ultra-2 | 1037. | Schlumpberger B.O., Clery R.A., et al., 2006 | 50. m/0.25 mm/0.32 μm, He, 2. K/min; Tstart: 50. C; Tend: 270. C |
Capillary | FSOT-RSL-200 | 1034. | Schmidt, Jirovetz, et al., 2006 | 30. m/0.32 mm/0.25 μm, Hydrogen, 40. C @ 5. min, 6. K/min, 280. C @ 5. min |
Capillary | HP-5MS | 1036. | Setzer, Noletto, et al., 2006 | 30. m/0.25 mm/0.25 μm, He, 60. C @ 5. min, 3. K/min; Tend: 280. C |
Capillary | BPX5 | 1022. | Boustie, Rapior, et al., 2005 | 25. m/0.20 mm/0.13 μm, He, 50. C @ 2. min, 3. K/min; Tend: 230. C |
Capillary | BPX5 | 1051. | Dickschat, Bode, et al., 2005 | 25. m/0.22 mm/0.25 μm, Helium, 50. C @ 5. min, 5. K/min; Tend: 320. C |
Capillary | BPX-5 | 1052. | Dickschat, Martens, et al., 2005 | 25. m/0.22 mm/0.25 μm, He, 50. C @ 5. min, 5. K/min; Tend: 320. C |
Capillary | ZB-5 | 1050. | Dötterl and Jürgens, 2005 | 60. m/0.25 mm/0.25 μm, He, 40. C @ 7. min, 6. K/min, 250. C @ 1. min |
Capillary | ZB-5 | 1050. | Dötterl, Wolfe, et al., 2005 | 60. m/0.25 mm/0.25 μm, He, 40. C @ 7. min, 6. K/min, 250. C @ 1. min |
Capillary | DB-5 | 1043. | El-Sayed, Heppelthwaite, et al., 2005 | 30. m/0.25 mm/0.25 μm, 40. C @ 2. min, 4. K/min; Tend: 240. C |
Capillary | DB-5 | 1045. | Jelén, Krawczyk, et al., 2005 | 30. m/0.25 mm/0.25 μm, He, 8. K/min; Tstart: 40. C; Tend: 280. C |
Capillary | RSL-200 | 1032. | Jirovetz, Buchbauer, et al., 2005 | 30. m/0.25 mm/0.25 μm, 40. C @ 2. min, 6. K/min, 280. C @ 10. min |
Capillary | SPB-5 | 1054. | Kilic, Kollmannsberger, et al., 2005 | He, 5. K/min; Column length: 30. m; Column diameter: 0.53 mm; Tstart: 100. C; Tend: 250. C |
Capillary | HP-5 | 1041.3 | Leffingwell and Alford, 2005 | 60. m/0.32 mm/0.25 μm, He, 30. C @ 2. min, 2. K/min, 260. C @ 28. min |
Capillary | MDN-5 | 1038. | van Loon, Linssen, et al., 2005 | 60. m/0.25 mm/0.25 μm, He, 40. C @ 4. min, 4. K/min, 270. C @ 5. min |
Capillary | DB-1 | 1008. | Nyegue, Belinga-Ndoye, et al., 2005 | 30. m/0.25 mm/0.25 μm, N2, 5. K/min; Tstart: 50. C; Tend: 200. C |
Capillary | SPB-5 | 1032. | Pino, Marbot, et al., 2005 | 30. m/0.25 mm/0.25 μm, He, 60. C @ 2. min, 4. K/min, 250. C @ 20. min |
Capillary | HP-5MS | 1052. | Shams-Ardakani, Ghannadi, et al., 2005 | 30. m/0.25 mm/0.25 μm, He, 15. K/min; Tstart: 60. C; Tend: 275. C |
Capillary | HP-5MS | 1060. | Tesevic, Nikicevic, et al., 2005 | 30. m/0.25 mm/0.25 μm, He, 4.3 K/min; Tstart: 60. C; Tend: 285. C |
Capillary | ZB-5 | 1046. | Jürgens and Dötterl, 2004 | 60. m/0.25 mm/0.25 μm, He, 40. C @ 4.6 min, 6. K/min, 260. C @ 1. min |
Capillary | DB-1 | 1000. | Park, Lee, et al., 2004 | 60. m/0.32 mm/0.25 μm, He, 35. C @ 4. min, 2. K/min, 230. C @ 25. min |
Capillary | DB-1 | 1002. | Park, Lee, et al., 2004 | 60. m/0.32 mm/0.25 μm, He, 35. C @ 4. min, 2. K/min, 230. C @ 25. min |
Capillary | DB-1 | 1002. | Park, Lee, et al., 2004 | 60. m/0.32 mm/0.25 μm, He, 35. C @ 4. min, 2. K/min, 230. C @ 25. min |
Capillary | DB-1 | 1004. | Park, Lee, et al., 2004 | 60. m/0.32 mm/0.25 μm, He, 35. C @ 4. min, 2. K/min, 230. C @ 25. min |
Capillary | HP-5 | 1032. | Simic, Sokovic, et al., 2004 | 25. m/0.32 mm/0.52 μm, H2, 4. K/min; Tstart: 40. C; Tend: 240. C |
Capillary | DB-5 | 1034. | Woerdenbag, Windono, et al., 2004 | 30. m/0.249 mm/0.25 μm, He, 3. K/min; Tstart: 60. C; Tend: 300. C |
Capillary | OV-101 | 1004. | Agnaniet, Mounzeo, et al., 2003 | 25. m/0.25 mm/0.25 μm, N2, 5. K/min; Tstart: 50. C; Tend: 200. C |
Capillary | HP-5 | 1030. | Ghannadi and Zolfaghari, 2003 | 30. m/0.25 mm/0.25 μm, He, 4. K/min; Tstart: 60. C; Tend: 275. C |
Capillary | RSL-200 | 1032. | Jirovetz, Buchbauer, et al., 2003 | 30. m/0.25 mm/0.25 μm, H2, 40. C @ 2. min, 6. K/min, 280. C @ 10. min |
Capillary | RSL-200 | 1034. | Jirovetz, Buchbauer, et al., 2003, 2 | 30. m/0.32 mm/0.25 μm, H2, 40. C @ 5. min, 6. K/min, 280. C @ 5. min |
Capillary | SPB-5 | 1040. | Ledauphin, Guichard, et al., 2003 | 30. m/0.32 mm/0.25 μm, He, 40. C @ 1. min, 5. K/min, 220. C @ 20. min |
Capillary | DB-5 | 1033. | Pino, Marbot, et al., 2003 | 30. m/0.25 mm/0.25 μm, H2, 60. C @ 10. min, 4. K/min, 280. C @ 40. min |
Capillary | SPB-5 | 1036. | Sebastian, Viallon-Fernandez, et al., 2003 | 60. m/0.32 mm/1.0 μm, Helium, 3. K/min; Tstart: 30. C; Tend: 230. C |
Capillary | SPB-1 | 1006. | Vichi, Pizzale, et al., 2003 | 30. m/0.25 mm/0.25 μm, He, 40. C @ 10. min, 3. K/min; Tend: 200. C |
Capillary | HP-5 | 1039. | Isidorov and Jdanova, 2002 | 3. K/min; Column length: 30. m; Column diameter: 0.25 mm; Tstart: 50. C; Tend: 200. C |
Capillary | RSL-200 | 1032. | Jirovetz, Smith, et al., 2002 | 30. m/0.25 mm/0.25 μm, H2, 40. C @ 2. min, 6. K/min, 280. C @ 10. min |
Capillary | DB-5 | 1033. | Kobaisy, Tellez, et al., 2002 | 30. m/0.25 mm/0.25 μm, He, 3. K/min; Tstart: 60. C; Tend: 240. C |
Capillary | SPB-5 | 1033. | Pino, Marbot, et al., 2002, 2 | 30. m/0.25 mm/0.25 μm, Helium, 60. C @ 2. min, 4. K/min, 250. C @ 20. min |
Capillary | DB-5 | 1034. | Tellez, Khan, et al., 2002 | 30. m/0.25 mm/0.25 μm, He, 3. K/min; Tstart: 60. C; Tend: 240. C |
Capillary | OV-101 | 1025. | Zenkevich and Rodin, 2002 | Nitrogen, 60. C @ 0. min, 4. K/min, 240. C @ 0. min; Column length: 25. m; Column diameter: 0.25 mm |
Capillary | DB-5MS | 1030. | Zoghbi, Andrade, et al., 2002 | 30. m/0.25 mm/0.25 μm, He, 3. K/min; Tstart: 60. C; Tend: 270. C |
Capillary | OV-101 | 1007. | Yang, 2001 | N2, 2. K/min; Column length: 50. m; Column diameter: 0.25 mm; Tstart: 80. C; Tend: 200. C |
Capillary | HP-5 | 1042. | García, Martín, et al., 2000 | 60. m/0.32 mm/1. μm, He, 3. K/min; Tstart: 40. C; Tend: 240. C |
Capillary | DB-5 | 1033. | Tellez, Dayan, et al., 2000 | 30. m/0.25 mm/0.25 μm, He, 3. K/min; Tstart: 60. C; Tend: 240. C |
Capillary | Methyl Silicone | 1006.50 | Baraldi, Rapparini, et al., 1999 | 60. m/0.25 mm/0.25 μm, 40. C @ 10. min, 5. K/min; Tend: 220. C |
Capillary | OV-101 | 1036. | Menon, Chacko, et al., 1999 | N2, 1. K/min, 200. C @ 20. min; Column length: 50. m; Column diameter: 0.2 mm; Tstart: 80. C |
Capillary | DB-1 | 1005. | Schultz, Kaiser, et al., 1999 | 4. K/min; Tstart: 50. C; Tend: 260. C |
Capillary | DB-5 | 1034. | Tellez, Canel, et al., 1999 | 30. m/0.25 mm/0.25 μm, He, 3. K/min; Tstart: 60. C; Tend: 240. C |
Capillary | HP-5 | 1037. | Boylston and Viniyard, 1998 | 50. m/0.32 mm/0.52 μm, 35. C @ 15. min, 2. K/min, 250. C @ 45. min |
Capillary | Optima 1 | 1021. | Fons, Rapior, et al., 1998 | 25. m/0.20 mm/0.25 μm, Helium, 3. K/min; Tstart: 50. C; Tend: 200. C |
Capillary | CBP-1 | 1036. | Lamarque, Maestri, et al., 1998 | He, 4. K/min; Column length: 30. m; Column diameter: 0.25 mm; Tstart: 60. C; Tend: 240. C |
Capillary | HP-1 | 1008. | Ong, Acree, et al., 1998 | 4. K/min; Column length: 25. m; Column diameter: 0.32 mm; Tstart: 35. C; Tend: 250. C |
Capillary | BPX-5 | 1051. | D'Arcy, Rintoul, et al., 1997 | 50. m/0.22 mm/0.25 μm, He, 50. C @ 1. min, 3. K/min, 250. C @ 10. min |
Capillary | DB-1 | 1035. | Sagrero-Nieves and Bartley, 1996 | 60. m/0.32 mm/0.50 μm, He, 50. C @ 1. min, 8. K/min, 250. C @ 6. min |
Capillary | SPB-1 | 1010. | Wong and Lai, 1996 | 50. m/0.2 mm/0.33 μm, He, 40. C @ 3. min, 3. K/min, 200. C @ 30. min |
Capillary | DB-1 | 1002. | Stashenko, Torres, et al., 1995 | 60. m/0.25 mm/0.25 μm, He, 50. C @ 5. min, 3.5 K/min; Tend: 250. C |
Capillary | OV-101 | 1005. | Tamura, Nakamoto, et al., 1995 | N2, 2. K/min; Column length: 50. m; Column diameter: 0.25 mm; Tstart: 80. C; Tend: 200. C |
Capillary | OV-101 | 1008. | Tamura, Nakamoto, et al., 1995 | N2, 2. K/min; Column length: 50. m; Column diameter: 0.25 mm; Tstart: 80. C; Tend: 200. C |
Capillary | DB-1 | 1004. | Buttery, Stern, et al., 1994 | He, 30. C @ 25. min, 4. K/min, 200. C @ 20. min; Column length: 60. m; Column diameter: 0.32 mm |
Capillary | OV-101 | 1007. | Tamura, Yang, et al., 1993 | 2. K/min; Column length: 50. m; Column diameter: 0.25 mm; Tstart: 80. C; Tend: 200. C |
Capillary | OV-101 | 1007. | Tamura, Yang, et al., 1993 | 2. K/min; Column length: 50. m; Column diameter: 0.25 mm; Tstart: 80. C; Tend: 200. C |
Capillary | DB-1 | 1004. | Binder, Turner, et al., 1990 | 4. K/min, 230. C @ 10. min; Tstart: 50. C |
Capillary | CP Sil 8 CB | 1039. | Jantan and Goh, 1990 | 60. C @ 10. min, 3. K/min; Column length: 25. m; Column diameter: 0.20 mm; Tend: 230. C |
Capillary | HP-5 | 1033. | Spadone, Takeoka, et al., 1990 | H2, 16. K/min; Column length: 50. m; Column diameter: 0.3 mm; Tstart: 80. C; Tend: 250. C |
Capillary | HP-5 | 1037. | Spadone, Takeoka, et al., 1990 | H2, 16. K/min; Column length: 50. m; Column diameter: 0.3 mm; Tstart: 80. C; Tend: 250. C |
Capillary | DB-1 | 1005. | Binder, Flath, et al., 1989 | 4. K/min, 250. C @ 5. min; Column length: 60. m; Column diameter: 0.32 mm; Tstart: 50. C |
Capillary | DB-1 | 1006. | Binder and Flath, 1989 | 50. C @ 0.1 min, 4. K/min, 250. C @ 5. min; Column length: 60. m; Column diameter: 0.32 mm |
Capillary | DB5-30W | 1038. | Schwab and Schreier, 1988 | 30. m/0.25 mm/0.25 μm, He, 5. K/min; Tstart: 60. C; Tend: 300. C |
Capillary | OV-101 | 1027. | Wu, Zhao, et al., 1987 | He, 3. K/min; Column length: 45. m; Column diameter: 0.25 mm; Tstart: 100. C; Tend: 180. C |
Capillary | DB-1 | 1001. | Flath, Mon, et al., 1983 | 50. C @ 0.1 min, 4. K/min, 250. C @ 5. min; Column length: 60. m; Column diameter: 0.32 mm |
Packed | Apiezon L | 1019. | Dahlmann, Köser, et al., 1979 | Chromosorb G-AW-DMCS, 10. K/min; Column length: 2. m; Tstart: 25. C |
Capillary | OV-1 | 1012. | Schreyen, Dirinck, et al., 1979 | N2, 1. K/min; Column length: 183. m; Column diameter: 0.762 mm; Tstart: 0. C; Tend: 230. C |

Normal alkane RI, non-polar column, custom temperature program

Column type | Active phase | I | Reference | Comment |
---|---|---|---|---|
Capillary | SLB-5 MS | 1040. | Mondello, 2012 | 30. m/0.25 mm/0.25 μm, Helium; Program: not specified |
Capillary | SLB-5 MS | 1041. | Mondello, 2012 | 30. m/0.25 mm/0.25 μm, Helium; Program: not specified |
Capillary | Polydimethyl siloxane with 5 % Ph groups | 1041. | Robinson, Adams, et al., 2012 | Program: not specified |
Capillary | Polydimethyl siloxane with 5 % Ph groups | 1047. | Robinson, Adams, et al., 2012 | Program: not specified |
Capillary | Siloxane, 5 % Ph | 1032. | VOC BinBase, 2012 | Program: not specified |
Capillary | Polydimethyl siloxane, 5 % phenyl | 1032. | Skogerson, Wohlgemuth, et al., 2011 | Program: not specified |
Capillary | CP-Sil 8 CB | 1039. | Di Giusto, Bessiere, et al., 2010 | 30. m/0.25 mm/0.25 μm, Helium; Program: Multi-rise program |
Capillary | HP-5 MS | 1032. | Pino, Marquez, et al., 2010 | 30. m/0.32 mm/0.25 μm, Helium; Program: not specified |
Capillary | ZB-1 MS | 1036. | Al-Reza, Rahman, et al., 2009 | 30. m/0.25 mm/0.25 μm, Helium; Program: 50 0C 3 0C/min -> 150 0C (10 min) 10 0C/min -> 250 0C |
Capillary | ZB-1 MS | 1036. | Bajpai, Al-Reza, et al., 2009 | 30. m/0.25 mm/0.25 μm, Helium; Program: 50 0C 3 0C/min -> 150 0C (10 min) 10 0C/min -> 250 0C |
Capillary | HP-5 MS | 1040. | Fan, Lu, et al., 2009 | 30. m/0.25 mm/0.25 μm, Helium; Program: 40 0C (3 min) 3 0C/min -> 160 0C (2 min) 8 0C/min -> 220 0C (3 min) |
Capillary | RTX-5 MS | 1027. | Mebazaa, Mahmoudi, et al., 2009 | 30. m/0.25 mm/0.25 μm, Helium; Program: 50 0C (5 min) 2 0C/min -> 100 0C (5 min) 5 0C/min -> 300 0C |
Capillary | RTX-5 MS | 1032. | Mebazaa, Mahmoudi, et al., 2009 | 30. m/0.25 mm/0.25 μm, Helium; Program: not specified |
Capillary | ZB-5 | 1036. | de Simon, Estruelas, et al., 2009 | 30. m/0.25 mm/0.25 μm, Helium; Program: 45 0C 3 0C/min -> 230 0C (10 min) 10 0C/min -> 270 0C (21 min) |
Capillary | CP-Sil 5 Cb | 1003. | Collin, Nizet, et al., 2008 | 50. m/0.32 mm/1.20 μm, Nitrogen; Program: 40 0C 20 0C/min -> 85 0C 1 0C/min -> 145 0C 3 0C/min -> 250 0C (30 min) |
Capillary | CB-1 | 1012. | Kannaste, Vongvanich, et al., 2008 | 30. m/0.25 mm/0.25 μm, Helium; Program: 40 0C (2 min) 4 0C/min -> 180 0C 20 0C/min -> 220 0C (1 min) |
Capillary | CB-1 | 1006. | Kannaste, Vongvanich, et al., 2008 | 30. m/0.25 mm/0.25 μm, Helium; Program: not specified |
Capillary | CP Sil 8 CB | 1032. | Kristiawan, Sobolik, et al., 2008 | 30. m/0.25 mm/0.25 μm; Program: 60C => 2.5C/min => 170C => 10C/min => 250C (5min) |
Capillary | CP-Sil 8CB-MS | 1030. | Profitt, Schatz, et al., 2008 | 30. m/0.25 mm/0.25 μm, Helium; Program: 50 0C(3 min) 3 0C/min -> 100 0C 2.7 0C/min -> 140 0C 2.4 0C/min -> 180 0C 6 0C/min -> 260 0C |
Capillary | HP-5 | 1036. | Zhao, Li, et al., 2008 | 30. m/0.25 mm/0.25 μm; Program: 40 0C (2 min) 5 0C/min -> 80 0C 7 oC/min -> 160 0C 9 0C/min -> 200 0C 20 0C/min -> 280 0C (10 min) |
Capillary | HP-5 | 1035. | Zhao, Li, et al., 2008 | 30. m/0.25 mm/0.25 μm; Program: not specified |
Capillary | DB-5 MS | 1013. | Zhu, Li, et al., 2008 | 30. m/0.25 mm/0.25 μm, Helium; Program: 50 0C (2.8 min) 5.5 0C/min -> 140 0C (1 min) 4.5 oC/min -> 220 0C -> 225 0C (2 min) 3.4 0C/min -> 265 0C (5 min) |
Capillary | DB-5 MS | 1031. | Zhu, Li, et al., 2008 | 30. m/0.25 mm/0.25 μm, Helium; Program: 50 0C (2.8 min) 5.5 0C/min -> 140 0C (1 min) 4.5 oC/min -> 220 0C -> 225 0C (2 min) 3.4 0C/min -> 265 0C (5 min) |
Capillary | DB-5 | 1033. | Beaulieu and Lancaster, 2007 | 30. m/0.25 mm/0.25 μm; Program: 50C(1min) => 5C/min => 100C => 10C/min => 250C (9min) |
Capillary | SPB-1 | 1033. | Bosch-Fuste, Riu-Aumatell, et al., 2007 | 30. m/0.25 mm/0.25 μm, He; Program: 40C(10min) => 2C/min => 200C(1min) => 2C/min => 250C (10min) |
Capillary | DB-5 MS | 1044. | Cajka, Hajslova, et al., 2007 | 30. m/0.25 mm/0.25 μm, Helium; Program: 45 0C (0.75 min) 10 0C/min -> 200 0C 30 0C/min -> 245 0C (1.25 min) |
Capillary | HP-5 | 1041. | Dou, Li, et al., 2007 | 30. m/0.32 mm/0.25 μm, He; Program: 40 0C (2 min) 110 0C (2 min) 3 0C/min -> 170 0C (2 min) 4 0C/min -> 220 0C (2 min) 10 0C/min -> 260 0C (5 min) |
Capillary | CP Sil 8 CB | 1036. | Meekijjaroenroj, Bessière, et al., 2007 | 30. m/0.25 mm/0.25 μm, He; Program: 50C(3min) => 3C/min => 100C => 2.7C/min => 140C => 2.4C/min => 180C => 6C/min => 250C |
Capillary | CP-Sil | 1030. | Proffit, 2007 | 30. m/0.25 mm/0.25 μm, Helium; Program: 50 0C (3 min) 3 0C/min -> 100 0C 2.7 0C/min -> 140 0C 2.4 0C/min -> 180 0C 6 0C/min -> 250 0C |
Capillary | CP-Sil | 1037. | Proffit, 2007 | 30. m/0.25 mm/0.25 μm, Helium; Program: 50 0C (3 min) 3 0C/min -> 100 0C 2.7 0C/min -> 140 0C 2.4 0C/min -> 180 0C 6 0C/min -> 250 0C |
Capillary | HP-5 | 1030. | Splivallo, Bossi, et al., 2007 | He; Program: 50C => 3C/min => 200C(10min) => 10C/min => 290C(10min) |
Capillary | 5 % Phenyl methyl siloxane | 1040. | Beaulieu J.C. and Lea J.M., 2006 | 30. m/0.25 mm/0.75 μm; Program: 50C(1min) => 5C/min => 100C => 10C/min => 190C => 30C/min => 250C(1min) |
Capillary | HP-5MS | 1042. | Alissandrakis, Kibaris, et al., 2005 | 30. m/0.25 mm/0.25 μm, He; Program: 40C(3min) => 2C/min => 180C => 10C/min => 250C(5min) |
Capillary | CP-Sil5 CB MS | 1003. | Iraqi, Vermeulen, et al., 2005 | 50. m/0.32 mm/1.2 μm; Program: 36C(2min) => 20C/min => 85C => 1C/min => 145C => 3C/min => 250C(30min) |
Capillary | Polydimethyl siloxane with 5 % Ph groups | 1032. | Pino, Marbot, et al., 2005, 2 | Program: not specified |
Capillary | CP Sil 5 CB | 1005. | Counet, Ouwerx, et al., 2004 | 50. m/0.32 mm/1.2 μm; Program: 36C => 20C/min => 85C => 1C/min => 145C => 3C/min => 250C(30min) |
Capillary | HP-5 | 1041. | Garcia-Estaban, Ansorena, et al., 2004 | 50. m/0.32 mm/1.05 μm; Program: 40C(10min) => 5C/min => 200C => 20C/min => 250C(5min) |
Capillary | DB-5 | 1041. | Garcia-Estaban, Ansorena, et al., 2004, 2 | 50. m/0.32 mm/1.05 μm; Program: 40C(10min) => 5C/min => 200C => 20C/min => 250C (5min) |
Capillary | SE-30 | 1033. | Vinogradov, 2004 | Program: not specified |
Capillary | 1022. | Bruce, Cork, et al., 2002, 2 | Program: not specified | |
Capillary | 1022. | Bruce, Cork, et al., 2002, 2 | Program: not specified | |
Capillary | CP Sil 5 CB | 1010. | Counet, Callemien, et al., 2002 | 50. m/0.32 mm/1.2 μm; Program: 36C => 20C/min => 85C => 1C/min => 145C=3C/min => 250C(30min) |
Capillary | HP-5 | 1036.9 | David, Scanlan, et al., 2002 | 50. m/0.32 mm/1.05 μm, He; Program: not specified |
Capillary | CP Sil 5 CB | 1009. | Guyot-Declerck, Renson, et al., 2002 | 50. m/0.32 mm/1.2 μm, He; Program: 36C => 20C/min => 85C => 1C/min => 145C => 3C/min => 250C |
Capillary | HP-5 | 1033. | Jordán, Goodner, et al., 2002 | 30. m/0.25 mm/0.25 μm; Program: not specified |
Capillary | HP-5 | 1051. | Jordán, Goodner, et al., 2002 | 30. m/0.25 mm/0.25 μm; Program: not specified |
Capillary | SPB-5 | 1043. | Lee and Kim, 2002 | 60. m/0.25 mm/0.25 μm, Helium; Program: 50 0C (3 min) 4 0C/min -> 200 0C 8 0C/min -> 240 0C (5 min) |
Capillary | DB-5 | 1027. | Rapior, Breheret, et al., 2002 | 30. m/0.20 mm/1.0 μm; Program: not specified |
Capillary | DB-5 | 1039. | Staples E.S., 2002 | Program: not specified |
Capillary | HP-5MS | 1038. | Ansorena, Gimeno, et al., 2001 | 30. m/0.25 mm/0.25 μm, He; Program: 40C (10min) => 3C/min => 120C => 10C/min => 250C (5min) |
Capillary | HP-5 | 1041. | Jordán, Shaw, et al., 2001 | 30. m/0.25 mm/0.25 μm; Program: 40C (6min) => 2.5C/min => 150C => 90C/min => 250C |
Capillary | OV-101 | 1007. | Yang, 2001 | N2; Column length: 50. m; Column diameter: 0.25 mm; Program: not specified |
Capillary | CP Sil 5 CB | 1015. | Guyot, Scheirman, et al., 1999 | He; Column length: 50. m; Column diameter: 0.32 mm; Program: 30C => 55C/min => 85C => 1C/min => 145C => 3C/min => 250C |
Capillary | CP Sil 5 CB | 1018. | Guyot, Bouseta, et al., 1998 | 50. m/0.32 mm/1.2 μm, He; Program: 30C => 55C/min => 85C => 1C/min => 145C => 3C/min => 250C |
Capillary | SF-96 | 1012. | Kawasaki, Matsui, et al., 1998 | Column length: 40. m; Column diameter: 0.28 mm; Program: 75C => 3C/min => 190C(25min) => 3C/min => 210C |
Capillary | HP-1 | 1003. | Ong, Acree, et al., 1998 | Column length: 25. m; Column diameter: 0.32 mm; Program: not specified |
Capillary | HP-5 | 1051. | Timón, Ventanas, et al., 1998 | 50. m/0.32 mm/0.52 μm, He; Program: 35 0C 10 0C/min -> 200 0C (20 min) 5 0C/min -> 230 0C (50 min) |
Capillary | Polydimethyl siloxanes | 1025. | Zenkevich and Chupalov, 1996 | Program: not specified |
Capillary | RSL-150 | 1009. | Buchbauer, Nikiforov, et al., 1994 | 60. m/0.32 mm/0.25 μm, He; Program: 30c (1.5min) => 20C/min => 55C => 6C/min => 200C(10min) |
Capillary | DB-5 | 1036. | Garneau, Bouhajib, et al., 1994 | Column length: 30. m; Column diameter: 0.25 mm; Program: not specified |
Capillary | DB-5 | 1036. | Jean, Garneau, et al., 1993 | Column length: 30. m; Column diameter: 0.25 mm; Program: not specified |
Capillary | DB-1 | 1004. | Binder, Flath, et al., 1989 | Column length: 60. m; Column diameter: 0.32 mm; Program: not specified |
Capillary | DB-1 | 1004. | Binder and Flath, 1989 | Column length: 60. m; Column diameter: 0.32 mm; Program: not specified |
Capillary | SE-54 | 1039. | Blank, Fischer, et al., 1989 | 30. m/0.32 mm/0.3 μm, He; Program: 35C(2min) => 40C/min => 50C(2min) => 6C/min => 230C(10min) |
Capillary | OV-101 | 1007. | Morales and Duque, 1987 | He; Column length: 25. m; Column diameter: 0.31 mm; Program: not specified |
Capillary | OV-101 | 1033. | Shibamoto, 1987 | Program: not specified |
Capillary | OV-101 | 1033. | Wu, Zhao, et al., 1987 | He; Column length: 45. m; Column diameter: 0.25 mm; Program: not specified |
Capillary | OV-101 | 1039. | Zenkevich and Malamakhov, 1987 | He; Column length: 50. m; Column diameter: 0.24 mm; Program: not specified |
Capillary | OV-1, SE-30, Methyl silicone, SP-2100, OV-101, DB-1, etc. | 1035. | Waggott and Davies, 1984 | Hydrogen; Column length: 50. m; Column diameter: 0.32 mm; Program: not specified |
Capillary | OV-1, SE-30, Methyl silicone, SP-2100, OV-101, DB-1, etc. | 1046. | Waggott and Davies, 1984 | Hydrogen; Column length: 50. m; Column diameter: 0.32 mm; Program: not specified |
Capillary | SF-96 | 1081. | Fagan, Kepner, et al., 1982 | He; Program: not specified |
Capillary | SF-96 | 1082. | Fagan, Kepner, et al., 1982 | He; Program: not specified |
Other | Methyl Silicone | 1046. | Ardrey and Moffat, 1981 | Program: not specified |

Normal alkane RI, polar column, temperature ramp

Column type | Active phase | I | Reference | Comment |
---|---|---|---|---|
Capillary | HP-FFAP | 1908. | Wanakhachornkrai and Lertsiri, 9999 | 25. m/0.32 mm/0.50 μm, Helium, 15. K/min; Tstart: 45. C; Tend: 220. C |
Capillary | HP-FFAP | 1908. | Wanakhachornkrai and Lertsiri, 9999 | 25. m/0.32 mm/0.50 μm, Helium, 15. K/min; Tstart: 45. C; Tend: 220. C |
Capillary | AT-Wax | 1899. | Kiss, Csoka, et al., 2011 | 60. m/0.25 mm/0.25 μm, Helium, 4. K/min; Tstart: 60. C; Tend: 280. C |
Capillary | VF-Wax MS | 1869. | Duarte, Dias, et al., 2010 | 60. m/0.25 mm/0.25 μm, Helium, 60. C @ 5. min, 3. K/min, 220. C @ 25. min |
Capillary | DB-Wax | 1905. | Moon and Shibamoto, 2010 | 60. m/0.25 mm/0.50 μm, Helium, 40. C @ 5. min, 2. K/min, 210. C @ 70. min |
Capillary | CP Wax 52 CB | 1877. | Birtic, Ginies, et al., 2009 | 30. m/0.32 mm/0.50 μm, Helium, 40. C @ 2. min, 4. K/min, 230. C @ 15. min |
Capillary | CP Wax 52 CB | 1877. | Birtic, Ginies, et al., 2009 | 30. m/0.32 mm/0.50 μm, Helium, 40. C @ 2. min, 4. K/min, 230. C @ 15. min |
Capillary | CP-Wax | 1891. | Mo, Fan, et al., 2009 | 60. m/0.25 mm/0.25 μm, Helium, 50. C @ 2. min, 6. K/min, 230. C @ 15. min |
Capillary | DB-Wax | 1879. | Zhao, Xu, et al., 2009 | 30. m/0.25 mm/0.25 μm, Helium, 40. C @ 2. min, 3. K/min, 230. C @ 5. min |
Capillary | Innowax | 1891. | Kaypak and Avsar, 2008 | 30. m/0.25 mm/0.25 μm, 40. C @ 5. min, 10. K/min, 200. C @ 15. min |
Capillary | HP-Innowax | 1893. | Soria, Sanz, et al., 2008 | 50. m/0.20 mm/0.20 μm, Helium, 45. C @ 2. min, 4. K/min, 190. C @ 50. min |
Capillary | Stabilwax | 1886. | Cros, Vandanjon, et al., 2007 | 60. m/0.25 mm/0.25 μm, Helium, 40. C @ 5. min, 3. K/min, 240. C @ 10. min |
Capillary | CP-Wax 52CB | 1879. | Povolo, Contarini, et al., 2007 | 60. m/0.32 mm/0.5 μm, He, 40. C @ 8. min, 4. K/min, 220. C @ 20. min |
Capillary | DB-Wax | 1909. | Wei A. and Shibamoto T., 2007 | 60. m/0.25 mm/0.25 μm, He, 60. C @ 8. min, 3. K/min, 180. C @ 80. min |
Capillary | DB-Wax | 1872. | Fan and Qian, 2006 | 30. m/0.32 mm/0.25 μm, He, 40. C @ 2. min, 4. K/min, 230. C @ 15. min |
Capillary | DB-Wax Etr | 1891. | Ibarz, Ferreira, et al., 2006 | 60. m/0.25 mm/0.25 μm, He, 40. C @ 5. min, 2. K/min, 230. C @ 100. min |
Capillary | HP-Innowax | 1869. | Komes, Ulrich, et al., 2006 | 30. m/0.25 mm/0.5 μm, He, 40. C @ 3. min, 2. K/min, 200. C @ 15. min |
Capillary | Carbowax 20M | 1885. | de la Fuente, Martinez-Castro, et al., 2005 | 50. m/0.25 mm/0.25 μm, Helium, 40. C @ 2. min, 4. K/min, 190. C @ 30. min |
Capillary | Innowax | 1875. | Joichi, Yomogida, et al., 2005 | 60. m/0.25 mm/0.25 μm, He, 5. K/min, 240. C @ 30. min; Tstart: 60. C |
Capillary | CP-Wax | 1862. | Ka, Choi, et al., 2005 | 30. m/0.32 mm/0.25 μm, He, 40. C @ 2. min, 5. K/min; Tend: 180. C |
Capillary | Carbowax 20M | 1845. | Krings, Brauer, et al., 2005 | 25. m/0.53 mm/2.0 μm, H2, 40. C @ 3. min, 5. K/min, 210. C @ 10. min |
Capillary | HP-20M | 1919. | Kulisic, Radonic, et al., 2005 | 50. m/0.20 mm/0.20 μm, Helium, 70. C @ 4. min, 4. K/min, 180. C @ 10. min |
Capillary | DB-Wax | 1870. | Lee, Umano, et al., 2005 | 30. m/0.25 mm/0.25 μm, He, 3. K/min, 180. C @ 40. min; Tstart: 50. C |
Capillary | DB-Wax | 1912. | Qian and Wang, 2005 | 60. m/0.32 mm/0.50 μm, Nitrogen, 35. C @ 4. min, 2. K/min, 235. C @ 30. min |
Capillary | CP-Wax 52CB | 1862. | Rohloff and Bones, 2005 | 30. m/0.32 mm/0.25 μm, He, 40. C @ 1. min, 4. K/min; Tend: 220. C |
Capillary | CP-Wax 52CB | 1862. | Rohloff and Bones, 2005 | 30. m/0.32 mm/0.25 μm, He, 40. C @ 1. min, 4. K/min; Tend: 220. C |
Capillary | PEG-20M | 1893. | Yao, Guo, et al., 2005 | 60. C @ 10. min, 3. K/min, 180. C @ 30. min; Column length: 30. m; Column diameter: 0.25 mm |
Capillary | DB-Wax | 1865. | Chida, Sone, et al., 2004 | 60. m/0.25 mm/0.5 μm, 35. C @ 5. min, 4. K/min, 240. C @ 10. min |
Capillary | DB-Wax | 1873. | Jiang and Kubota, 2004 | He, 60. C @ 4. min, 2. K/min; Column length: 60. m; Column diameter: 0.25 mm; Tend: 220. C |
Capillary | DB-Wax | 1905. | López, Ezpeleta, et al., 2004 | 60. m/0.25 mm/0.25 μm, He, 40. C @ 5. min, 3. K/min; Tend: 220. C |
Capillary | PEG-20M | 1834. | Narain, Almeida, et al., 2004 | 50. m/0.20 mm/0.20 μm, 40. C @ 5. min, 3. K/min, 180. C @ 30. min |
Capillary | PEG-20M | 1884. | Narain, Almeida, et al., 2004 | 50. m/0.20 mm/0.20 μm, 40. C @ 5. min, 3. K/min, 180. C @ 30. min |
Capillary | HP-Innowax | 1908. | Soria, Gonzalez, et al., 2004 | 50. m/0.2 mm/0.2 μm, He, 45. C @ 2. min, 4. K/min, 190. C @ 50. min |
Capillary | Carbowax 20M | 1862. | Agnaniet, Mounzeo, et al., 2003 | 25. m/0.22 mm/0.25 μm, N2, 5. K/min; Tstart: 50. C; Tend: 200. C |
Capillary | Stabilwax | 1886. | Cros, Vandanjon, et al., 2003, 2 | 60. m/0.25 mm/0.25 μm, Helium, 40. C @ 5. min, 3. K/min, 240. C @ 10. min |
Capillary | DB-Wax | 1874. | Dregus and Engel, 2003 | 60. m/0.32 mm/0.25 μm, H2, 40. C @ 5. min, 4. K/min, 230. C @ 25. min |
Capillary | DB-Wax | 1874. | Lin, Cai, et al., 2003 | 30. m/0.25 mm/0.25 μm, He, 50. C @ 2. min, 3. K/min, 230. C @ 20. min |
Capillary | TC-Wax | 1885. | Miyazawa and Okuno, 2003 | He, 4. K/min, 250. C @ 30. min; Column length: 60. m; Column diameter: 0.25 mm; Tstart: 80. C |
Capillary | TC-Wax | 1873. | Miyazawa, Yamafuji, et al., 2003 | 3. K/min; Column length: 60. m; Column diameter: 0.25 mm; Tstart: 80. C; Tend: 240. C |
Capillary | Carbowax 20M | 1873. | Saura, LAencina, et al., 2003 | Helium, 50. C @ 2. min, 4. K/min; Column length: 50. m; Column diameter: 0.70 mm; Tend: 280. C |
Capillary | HP-Innowax | 1894. | Soria, Martinez-Castro, et al., 2003 | 50. m/0.2 mm/0.2 μm, He, 45. C @ 2. min, 4. K/min, 190. C @ 50. min |
Capillary | Carbowax 20M | 1894. | Soria, Martinez-Castro, et al., 2003 | 50. m/0.25 mm/0.25 μm, He, 45. C @ 2. min, 4. K/min, 190. C @ 50. min |
Capillary | DB-Wax | 1879. | Tanaka, Yamauchi, et al., 2003 | 30. m/0.25 mm/0.25 μm, 30. C @ 1. min, 4. K/min; Tend: 250. C |
Capillary | DB-Wax | 1881. | Tanaka, Yamauchi, et al., 2003 | 30. m/0.25 mm/0.25 μm, 30. C @ 1. min, 4. K/min; Tend: 250. C |
Capillary | Supelcowax-10 | 1883. | Vichi, Castellote, et al., 2003 | 30. m/0.25 mm/0.25 μm, He, 40. C @ 10. min, 3. K/min; Tend: 200. C |
Capillary | Supelcowax-10 | 1861. | Vichi, Pizzale, et al., 2003 | 30. m/0.25 mm/0.25 μm, He, 40. C @ 10. min, 3. K/min; Tend: 200. C |
Capillary | HP-FFAP | 1908. | Wanakhachornkrai and Lertsiri, 2003 | 25. m/0.32 mm/0.5 μm, He, 15. K/min; Tstart: 45. C; Tend: 220. C |
Capillary | HP-FFAP | 1908. | Wanakhachornkrai and Lertsiri, 2003 | 25. m/0.32 mm/0.5 μm, He, 15. K/min; Tstart: 45. C; Tend: 220. C |
Capillary | DB-Wax | 1844. | Fu, Yoon, et al., 2002 | 30. m/0.25 mm/0.25 μm, He, 40. C @ 5. min, 8. K/min, 250. C @ 5. min |
Capillary | DB-Wax | 1874. | Hayata, Sakamoto, et al., 2002 | 60. m/0.25 mm/0.25 μm, He, 40. C @ 10. min, 3. K/min, 220. C @ 10. min |
Capillary | DB-Wax | 1891. | Ito, Sugimoto, et al., 2002 | 60. C @ 4. min, 3. K/min; Column length: 60. m; Column diameter: 0.25 mm; Tend: 180. C |
Capillary | FFAP | 1837. | Lecanu, Ducruet, et al., 2002 | 30. m/0.32 mm/1. μm, He, 35. C @ 3. min, 5. K/min; Tend: 240. C |
Capillary | DB-Wax | 1876. | Osorio, Duque, et al., 2002 | 30. m/0.25 mm/0.25 μm, He, 50. C @ 4. min, 4. K/min, 220. C @ 20. min |
Capillary | DB-Wax | 1878. | Osorio, Duque, et al., 2002 | 30. m/0.25 mm/0.25 μm, He, 50. C @ 4. min, 4. K/min, 220. C @ 20. min |
Capillary | TC-Wax | 1875. | Suhardi, Suzuki, et al., 2002 | 60. m/0.25 mm/0.25 μm, He, 40. C @ 10. min, 3. K/min, 230. C @ 10. min |
Capillary | DB-Wax | 1864. | Umano, Hagi, et al., 2002 | 60. m/0.25 mm/0.25 μm, He, 40. C @ 2. min, 2. K/min; Tend: 200. C |
Capillary | FFAP | 1871. | Ducruet, Fournier, et al., 2001 | 30. m/0.32 mm/0.25 μm, H2, 40. C @ 5. min, 3. K/min; Tend: 240. C |
Capillary | DB-Wax | 1896. | Jiang, Kojima, et al., 2001 | He, 60. C @ 4. min, 2. K/min; Column length: 60. m; Column diameter: 0.25 mm; Tend: 220. C |
Capillary | DB-Wax | 1874. | Lee and Shibamoto, 2001 | 30. m/0.25 mm/0.25 μm, He, 3. K/min, 180. C @ 40. min; Tstart: 50. C |
Capillary | Carbowax 20M | 1868. | Vernin, Lageot, et al., 2001 | 50. m/0.22 mm/0.25 μm, He, 2. K/min; Tstart: 60. C; Tend: 220. C |
Capillary | DB-Wax | 1882. | Weckerle, Bastl-Borrmann, et al., 2001 | 30. m/0.25 mm/0.25 μm, He, 50. C @ 3. min, 4. K/min; Tend: 220. C |
Capillary | DB-Wax | 1874. | Buttery, Light, et al., 2000 | 60. m/0.25 mm/0.25 μm, 30. C @ 4. min, 2. K/min, 170. C @ 30. min |
Capillary | DB-Wax | 1878. | Lee and Shibamoto, 2000 | 30. m/0.25 mm/0.25 μm, He, 3. K/min, 180. C @ 40. min; Tstart: 50. C |
Capillary | DB-Wax | 1864. | Morales, Duque, et al., 2000 | 25. m/0.25 mm/0.25 μm, He, 50. C @ 4. min, 4. K/min, 200. C @ 10. min |
Capillary | DB-Wax | 1872. | Morales, Duque, et al., 2000 | 25. m/0.25 mm/0.25 μm, He, 50. C @ 4. min, 4. K/min, 200. C @ 10. min |
Capillary | DB-Wax | 1853. | Parada, Duque, et al., 2000 | 30. m/0.25 mm/0.25 μm, He, 50. C @ 3. min, 4. K/min, 240. C @ 10. min |
Capillary | DB-Wax | 1858. | Parada, Duque, et al., 2000 | 30. m/0.25 mm/0.25 μm, He, 50. C @ 3. min, 4. K/min, 240. C @ 10. min |
Capillary | DB-Wax | 1874. | Umano, Hagi, et al., 2000 | 60. m/0.25 mm/0.25 μm, He, 40. C @ 2. min, 2. K/min; Tend: 200. C |
Capillary | PEG-20M | 1875. | Hirose, Joichi, et al., 1999 | N2, 3. K/min; Column length: 60. m; Column diameter: 0.25 mm; Tstart: 70. C; Tend: 220. C |
Capillary | CP-Wax 52CB | 1826. | Hwan and Chou, 1999 | 50. m/0.32 mm/0.22 μm, H2, 60. C @ 4. min, 2. K/min, 190. C @ 21. min |
Capillary | Carbowax | 1822. | Menon, Chacko, et al., 1999 | N2, 1. K/min, 200. C @ 20. min; Column length: 50. m; Column diameter: 0.2 mm; Tstart: 80. C |
Capillary | DB-Wax | 1878. | Umano, Nakahara, et al., 1999 | 60. m/0.25 mm/0.25 μm, He, 40. C @ 2. min, 2. K/min; Tend: 200. C |
Capillary | Supelcowax-10 | 1878. | Lamarque, Maestri, et al., 1998 | He, 4. K/min; Column length: 30. m; Column diameter: 0.25 mm; Tstart: 60. C; Tend: 240. C |
Capillary | DB-Wax | 1853. | Parada and Duque, 1998 | 30. m/0.25 mm/0.25 μm, He, 50. C @ 3. min, 4. K/min, 240. C @ 10. min |
Capillary | DB-Wax | 1860. | Parada and Duque, 1998 | 30. m/0.25 mm/0.25 μm, He, 50. C @ 3. min, 4. K/min, 240. C @ 10. min |
Capillary | Innowax | 1880. | Petersen, Poll, et al., 1998 | 30. m/0.25 mm/0.25 μm, 40. C @ 10. min, 6. K/min, 240. C @ 25. min |
Capillary | DB-Wax | 1855. | Ravichandran and Parthiban, 1998 | 60. m/0.25 mm/0.25 μm, 2. K/min; Tstart: 50. C; Tend: 230. C |
Capillary | PEG-20M | 1875. | Awano, Honda, et al., 1997 | He, 3. K/min; Column length: 60. m; Column diameter: 0.25 mm; Tstart: 70. C; Tend: 210. C |
Capillary | DB-Wax | 1881. | Sekiwa, Kubota, et al., 1997 | He, 2. K/min; Column length: 60. m; Column diameter: 0.25 mm; Tstart: 60. C; Tend: 180. C |
Capillary | DB-Wax | 1879. | Wada and Shibamoto, 1997 | He, 3. K/min, 200. C @ 40. min; Column length: 60. m; Column diameter: 0.25 mm; Tstart: 50. C |
Capillary | PEG-20M | 1829. | Kubota, Matsujage, et al., 1996 | 50. m/0.25 mm/0.25 μm, Nitrogen, 2. K/min; Tstart: 60. C; Tend: 180. C |
Capillary | DB-Wax | 1854. | Morales, Albarracín, et al., 1996 | 30. m/0.25 mm/0.25 μm, He, 20. C @ 4. min, 4. K/min, 200. C @ 10. min |
Capillary | DB-Wax | 1853. | Morales, Albarracín, et al., 1996 | 30. m/0.25 mm/0.25 μm, He, 50. C @ 4. min, 4. K/min, 200. C @ 10. min |
Capillary | DB-Wax | 1849. | Pollak and Berger, 1996 | 30. m/0.32 mm/0.5 μm, He, 40. C @ 1. min, 3. K/min, 210. C @ 25. min |
Capillary | DB-Wax | 1821. | Sagrero-Nieves and Bartley, 1996 | 60. m/0.32 mm/0.50 μm, He, 50. C @ 1. min, 8. K/min, 250. C @ 6. min |
Capillary | TC-Wax | 1893. | Shuichi, Masazumi, et al., 1996 | 80. C @ 5. min, 3. K/min; Column length: 60. m; Column diameter: 0.25 mm; Tend: 240. C |
Capillary | Supelcowax-10 | 1876. | Wong and Lai, 1996 | 60. m/0.25 mm/0.25 μm, He, 40. C @ 3. min, 3. K/min, 200. C @ 30. min |
Capillary | Carbowax 20M | 1833. | Kawakami, Ganguly, et al., 1995 | 60. C @ 4. min, 2. K/min; Column length: 60. m; Column diameter: 0.25 mm; Tend: 180. C |
Capillary | PEG-20M | 1830. | Togari, Kobayashi, et al., 1995 | 50. m/0.25 mm/0.15 μm, He, 60. C @ 4. min, 2. K/min; Tend: 180. C |
Capillary | PEG-20M | 1833. | Togari, Kobayashi, et al., 1995 | 50. m/0.25 mm/0.15 μm, He, 60. C @ 4. min, 2. K/min; Tend: 180. C |
Capillary | Carbowax 20M | 1833. | Kawakami, Kobayashi, et al., 1993 | He, 60. C @ 4. min, 2. K/min; Column length: 50. m; Column diameter: 0.25 mm; Tend: 180. C |
Capillary | DB-Wax | 1836. | Hatsuko, Kazuko, et al., 1992 | He, 60. C @ 10. min, 3. K/min; Column length: 30. m; Column diameter: 0.25 mm; Tend: 240. C |
Capillary | Carbowax 20M | 1833. | Kawakami and Kobayashi, 1991 | He, 60. C @ 4. min, 2. K/min; Column length: 50. m; Column diameter: 0.25 mm; Tend: 180. C |
Capillary | PEG-20M | 1829. | Kubota, Nakamoto, et al., 1991 | N2, 2. K/min; Column length: 50. m; Column diameter: 0.25 mm; Tstart: 60. C; Tend: 180. C |
Capillary | DB-Wax | 1864. | Binder, Turner, et al., 1990 | 4. K/min, 230. C @ 10. min; Column length: 60. m; Column diameter: 0.32 mm; Tstart: 50. C |
Capillary | Supelcowax-10 | 1905. | Loughrin, Hamilton-Kemp, et al., 1990 | He, 60. C @ 1. min, 2. K/min; Column length: 60. m; Column diameter: 0.32 mm; Tend: 220. C |
Capillary | DB-Wax | 1869. | Binder, Flath, et al., 1989 | 50. C @ 0.1 min, 4. K/min, 230. C @ 10. min; Column length: 60. m; Column diameter: 0.32 mm |
Capillary | DB-Wax | 1870. | Binder and Flath, 1989 | 50. C @ 0.1 min, 4. K/min, 250. C @ 5. min; Column length: 60. m; Column diameter: 0.32 mm |
Capillary | Supelcowax-10 | 1903. | Hamilton-Kemp, Andersen, et al., 1988 | 60. C @ 1. min, 3. K/min; Column length: 60. m; Column diameter: 0.32 mm; Tend: 220. C |
Capillary | Carbowax 20M | 1841. | Mihara, Tateba, et al., 1988 | N2, 3. K/min; Column length: 50. m; Column diameter: 0.22 mm; Tstart: 80. C; Tend: 200. C |
Capillary | Carbowax 20M | 1844. | Mihara, Tateba, et al., 1988 | N2, 3. K/min; Column length: 50. m; Column diameter: 0.22 mm; Tstart: 80. C; Tend: 200. C |
Capillary | DB-Wax | 1870. | Takeoka, Flath, et al., 1988 | 60. m/0.25 mm/0.25 μm, H2, 30. C @ 2. min, 2. K/min; Tend: 180. C |
Capillary | DB-Wax | 1872. | Takeoka, Flath, et al., 1988 | 60. m/0.25 mm/0.25 μm, H2, 30. C @ 2. min, 2. K/min; Tend: 180. C |
Capillary | DB-Wax | 1879. | Andersen J.F., Mikolajczak K.L., et al., 1987 | Helium, 40. C @ 1. min, 6. K/min; Column length: 30. m; Column diameter: 0.32 mm; Tend: 200. C |
Capillary | Carbowax 20M | 1840. | Buttery, Ling, et al., 1987 | 60. C @ 40. min, 1. K/min; Column length: 150. m; Column diameter: 0.66 mm; Tend: 170. C |
Capillary | Carbowax 20M | 1841. | Mihara, Tateba, et al., 1987 | N2, 3. K/min; Column length: 50. m; Column diameter: 0.22 mm; Tstart: 80. C; Tend: 200. C |
Capillary | Carbowax 20M | 1844. | Mihara, Tateba, et al., 1987 | N2, 3. K/min; Column length: 50. m; Column diameter: 0.22 mm; Tstart: 80. C; Tend: 200. C |
Packed | Carbowax 20M | 1862. | Stancher and Pertoldi, 1967 | Hydrogen, Gas-Chrom Z (80-100 mesh), 4. K/min; Column length: 2. m; Tstart: 65. C; Tend: 220. C |

Normal alkane RI, polar column, custom temperature program

Column type | Active phase | I | Reference | Comment |
---|---|---|---|---|
Capillary | DB-Wax | 1877. | Gyawali and Kim, 2012 | 60. m/0.20 mm/0.25 μm, Helium; Program: 40 0C (3 min) 2 0C/min -> 150 0C 4 0C/min -> 220 0C (20 min) 5 0C/min -> 230 0C |
Capillary | HP-FFAP | 1826. | Toontom, Meenune, et al., 2012 | 25. m/0.32 mm/0.50 μm, Helium; Program: 45 0C (2 min) 3 0C/min -> 130 0C (1 min) 20 0C/min -> 220 0C (3 min) 20 0C/min -> 230 0C (3 min) |
Capillary | DB-Wax | 1869. | Welke, Manfroi, et al., 2012 | 30. m/0.25 mm/0.25 μm, Helium; Program: not specified |
Capillary | DB-Wax | 1895. | Welke, Manfroi, et al., 2012 | 30. m/0.25 mm/0.25 μm, Helium; Program: not specified |
Capillary | SOLGel-Wax | 1900. | Johanningsmeier and McFeeters, 2011 | 30. m/0.25 mm/0.25 μm, Helium; Program: 40 0C (2 min) 5 0C/min -> 140 0C 10 0C/min -> 250 0C (3 min) |
Capillary | SOLGel-Wax | 1874. | Johanningsmeier and McFeeters, 2011 | 30. m/0.25 mm/0.25 μm, Helium; Program: not specified |
Capillary | Innowax | 1893. | Noorizadeh, Farmany, et al., 2011 | 60. m/0.25 mm/0.33 μm; Program: not specified |
Capillary | HP-Innowax | 1898. | Xiao, Dai, et al., 2011 | 60. m/0.25 mm/0.25 μm, Helium; Program: 40 0C (2 min) 3 0C/min -> 150 0C 5 0C/min -> 220 0C (5 min) |
Capillary | DB-Wax | 1828. | Parker, Tsormpatsidis, et al., 2010 | Program: not specified |
Capillary | Supelko CO Wax | 1890. | Vekiari, Orepoulou, et al., 2010 | 60. m/0.32 mm/0.25 μm, Helium; Program: 40 0C (5 min) 4 0C/min -> 75 0C 5 0C/min -> 250 0C (10 min) |
Capillary | Supelko CO Wax | 1883. | Vekiari, Orepoulou, et al., 2010 | 60. m/0.32 mm/0.25 μm, Helium; Program: not specified |
Capillary | Stabilwax | 1899. | Chinnici, Guerrero, et al., 2009 | 30. m/0.25 mm/0.25 μm, Helium; Program: 35 0C 3 0C/min -> 100 0C 5 0C/min -> 240 0C (10 min) |
Capillary | DB-FFAP | 1862. | Mebazaa, Mahmoudi, et al., 2009 | 30. m/0.25 mm/0.25 μm, Helium; Program: 50 0C 2 0C/min -> 100 0C (5 min) 5 0C/min -> 250 0C |
Capillary | DB-FFAP | 1897. | Mebazaa, Mahmoudi, et al., 2009 | 30. m/0.25 mm/0.25 μm, Helium; Program: not specified |
Capillary | CP-Wax 52 CB | 1877. | Romeo, Verzera, et al., 2009 | 60. m/0.25 mm/0.25 μm, Helium; Program: 45 0C (5 min) 3 0C/min -> 150 0C 10 0C/min -> 240 0C |
Capillary | Supelcowax-10 | 1854. | de Simon, Estruelas, et al., 2009 | 30. m/0.25 mm/0.25 μm, Helium; Program: 45 0C 3 0C/min -> 230 0C (10 min) 10 0C/min -> 270 0C (21 min) |
Capillary | DB-Wax | 1868. | Zhao, Xu, et al., 2009 | 30. m/0.25 mm/0.25 μm, Helium; Program: not specified |
Capillary | FFAP | 1844. | Frauendorfer and Schieberle, 2008 | Helium; Program: not specified |
Capillary | DB-Wax | 1858. | Tao, Wenlai, et al., 2008 | 30. m/0.32 mm/0.25 μm, Helium; Program: 50 0C 20 0C/min -> 80 0C 3 0C/min -> 230 0C |
Capillary | DB-Wax | 1896. | Yongsheng, Hua, et al., 2008 | 30. m/0.32 mm/0.25 μm, Helium; Program: 40 0C (4 min) 3 0C/min -> 50 0C 5 0C/min -> 120 0C 7 0C/min -> 175 0C 10 0C/min -> 230 0C (8 min) |
Capillary | PEG 20M | 1862. | Zhang, Zhang, et al., 2008 | 30. m/0.25 mm/0.25 μm, Helium; Program: 40 0C (3 min) 5 0C/min -> 60 0C 6 0C/min -> 130 0C 10 0C/min -> 230 0C |
Capillary | Supelcowax-10 | 1870. | Bosch-Fuste, Riu-Aumatell, et al., 2007 | 30. m/0.25 mm/0.25 μm, He; Program: 40C(10min) => 2C/min => 200C(1min) => 2C/min => 250C (10min) |
Capillary | HP-20M | 1861. | Chaieb, Hajlaoui, et al., 2007 | Program: not specified |
Capillary | DB-Wax Etr | 1891. | Loskos, Hernandez-Orte, et al., 2007 | 60. m/0.25 mm/0.5 μm, He; Program: 40C(3min) => 10C/min => 90C => 2C/min => 230C (37min) |
Capillary | HP-Innowax | 1821. | Narain, Galvao, et al., 2007 | 30. m/0.25 mm/0.25 μm, Helium; Program: 30 0C (5 min) 5 0C/min -> 100 0C (5 min) 1 0C/min -> 130 0C 10 0C/min -> 195 0C (45 min) |
Capillary | DB-Wax | 1866. | Selli, 2007 | 30. m/0.32 mm/0.50 μm, Hydrogen; Program: 60 0C (3 min) 2 0C/min -> 220 0C 3 0C/min -> 245 0C (20 min) |
Capillary | DB-Wax | 1869. | Tian, Zhang, et al., 2007 | 30. m/0.25 mm/0.25 μm, He; Program: 50 0C (2 min) 6 0C/min -> 150 0C 8 0C/min -> 230 0C (15 min) |
Capillary | Supelcowax-10 | 1889. | Vichi, Guadayol, et al., 2007 | 30. m/0.25 mm/0.25 μm, He; Program: 40C(3min) => 4C/min => 75C => 8C/min => 250C(5min) |
Capillary | HP-Innowax | 1899. | Viegas and Bassoli, 2007 | 60. m/0.32 mm/0.25 μm, Helium; Program: 40 0C (5 min) 4 0C/min -> 60 0C (5 min) 8 0C/min -> 250 0C (3 min) |
Capillary | HP-Innowax | 1878. | Viegas and Bassoli, 2007 | 60. m/0.32 mm/0.25 μm, Helium; Program: not specified |
Capillary | PEG-20M | 1862. | Zhang C., Zhang H., et al., 2007 | 30. m/0.25 mm/0.25 μm; Program: 40C(3min) => 5C/min => 60C => 6C/min => 130C => 10C/min => 230C (10min) |
Capillary | Carbowax 20M | 1844. | Editorial paper, 2005 | Program: not specified |
Capillary | CP-Wax 52CB | 1831. | Jales, Maia, et al., 2005 | Hydrogen; Program: not specified |
Capillary | Carbowax 20M | 1870. | Vinogradov, 2004 | Program: not specified |
Capillary | HP-Innowax | 1885. | Piasenzotto, Gracco, et al., 2003 | 30. m/0.32 mm/0.5 μm, He; Program: 50C(4min) => 10C/min => 230C(10min) => 10C/min => 250C |
Capillary | Carbowax 20M | 1871. | Saura, LAencina, et al., 2003 | Helium; Column length: 50. m; Column diameter: 0.70 mm; Program: not specified |
Capillary | DB-Wax | 1853. | Selli, Cabaroglu, et al., 2003 | 30. m/0.32 mm/0.5 μm, He; Program: 60C(2min) => 2C/min => 220C => 3C/min => 245C(20min) |
Capillary | HP Innowax FSP | 1896. | Tasdemir, Demirci, et al., 2003 | 60. m/0.25 mm/0.25 μm, He; Program: 60C(10min) => 4C/min => 220C (10min) => 1C/min => 240C |
Capillary | HP Innowax FSP | 1896. | Tasdemir, Demirci, et al., 2003 | 60. m/0.25 mm/0.25 μm, He; Program: 60C(10min) => 4C/min => 220C (10min) => 1C/min => 240C |
Capillary | 1887. | Bruce, Cork, et al., 2002, 2 | Program: not specified | |
Capillary | 1888. | Bruce, Cork, et al., 2002, 2 | Program: not specified | |
Capillary | Supelcowax-10 | 1839. | Lee and Kim, 2002 | 30. m/0.32 mm/0.25 μm, Helium; Program: 40 0C (5 min) 4 0C/min -> 150 0C 8 0C/min -> 240 0C |
Capillary | Nukol | 1872. | López and Dufour, 2001 | N2; Column length: 25. m; Column diameter: 0.25 mm; Program: 45C(5min) => 20C/min => 100C(1min) => 3C/min => 190C(40min) |
Capillary | DB-Wax | 1862. | Mayorga, Knapp, et al., 2001 | 30. m/0.25 mm/0.25 μm; Program: 50C(4min) => 4C/min => 130C => 1C/min => 190C => 4C/min => 220C(20min) |
Capillary | DB-Wax | 1865. | Mayorga, Knapp, et al., 2001 | 30. m/0.25 mm/0.25 μm; Program: 50C(4min) => 4C/min => 130C => 1C/min => 190C => 4C/min => 220C(20min) |
Capillary | Supelcowax-10 | 1882. | Rogerson, Castro, et al., 2001 | 60. m/0.25 mm/0.25 μm; Program: 40C(20min) => 1.5C/min => 200C(4min) => 10C/min => 250C(120min) |
Capillary | Innowax FSC | 1896. | Saglam, Gozler, et al., 2001 | 60. m/0.25 mm/0.25 μm, He; Program: 60C(10min) => 4C/min => 220C(10min) => 1C/min => 240C |
Capillary | FFAP | 1867. | Lambert, Demazeau, et al., 1999 | 30. m/0.32 mm/0.25 μm; Program: not specified |
Capillary | PEG | 1893. | Vas, Gal, et al., 1998 | 40. m/0.182 mm/0.30 μm, Hydrogen; Program: 35 0C (5 min) 5 0C/min -> 100 0C 3 0C/min -> 200 0C (1 min) 20 0C/min -> 240 0C (2 min) |
Capillary | DB-Wax | 1871. | Ziegleder, 1998 | He; Column length: 60. m; Column diameter: 0.25 mm; Program: 45C(4min) => 30C/min => 60C (5min) => 3C/min => 220C(40min) |
Capillary | CP-Wax 52CB | 1877. | López-Tamames, Carro-Mariño, et al., 1997 | 25. m/0.3 mm/1.2 μm, H2; Program: 60C(3min) => 2C/min => 220C => 3C/min => 245C |
Capillary | CP-Wax 52 CB | 1877. | Carro Marino, López Tamames, et al., 1995 | H2; Column length: 30. m; Column diameter: 0.32 mm; Program: 60 0C 2 0C/min -> 220 0C 3 0C/min -> 245 0C |
Capillary | Supelcowax | 1870. | Garneau, Bouhajib, et al., 1994 | Column length: 30. m; Column diameter: 0.25 mm; Program: not specified |
Capillary | Supelcowax-10 | 1872. | Jean, Garneau, et al., 1993 | Column length: 30. m; Column diameter: 0.25 mm; Program: not specified |
Capillary | DB-Wax | 1837. | Hatsuko, Kazuko, et al., 1992 | He; Column length: 30. m; Column diameter: 0.25 mm; Program: not specified |
Capillary | DB-Wax | 1845. | Marlatt, Ho, et al., 1992 | 30. m/0.25 mm/0.25 μm; Program: not specified |
Capillary | Supelcowax-10 | 1884. | Miranda-Lopez, Libbey, et al., 1992 | 30. m/0.53 mm/0.25 μm; Program: 80C(5min) => 5C/min => 155C => 4C/min => 240C(30min) |
Capillary | DB-Wax | 1857. | Peng, Yang, et al., 1991 | Program: not specified |
Capillary | DB-Wax | 1872. | Binder, Flath, et al., 1989 | Column length: 60. m; Column diameter: 0.32 mm; Program: not specified |
Capillary | DB-Wax | 1872. | Binder and Flath, 1989 | Column length: 60. m; Column diameter: 0.32 mm; Program: not specified |
Capillary | Carbowax 20M | 1822. | Shibamoto, 1987 | Program: not specified |
Capillary | Polyethylene Glycol | 1822. | MacLeod and Pieris, 1981 | Program: not specified |

Lee's RI, non-polar column, temperature ramp

Column type | Active phase | I | Reference | Comment |
---|---|---|---|---|
Capillary | DB-5 | 167.2 | Donnelly, Abdel-Hamid, et al., 1993 | 30. m/0.32 mm/0.25 μm, He, 40. C @ 3. min, 8. K/min, 285. C @ 29.5 min |

References

Papina, Pimenova, et al., 1995
Papina, T.S.; Pimenova, S.M.; Luk'yanova, V.A.; Kolesov, V.P.,
Standard enthalpies of formation of benzyl alcohol and α,α,α-trichlorotoluene,
Russ. J. Phys. Chem. (Engl. Transl.), 1995, 69, 1951-1953, In original 2148. [all data]
Parks, Manchester, et al., 1954
Parks, G.S.; Manchester, K.E.; Vaughan, L.M.,
Heats of combustion and formation of some alcohols, phenols, and ketones,
J. Chem. Phys., 1954, 22, 2089-2090. [all data]
Landrieu, Baylocq, et al., 1929
Landrieu, P.; Baylocq, F.; Johnson, J.R.,
Etude thermochimique dans la serie furanique,
Bull. Soc. Chim. France, 1929, 45, 36-49. [all data]
Schmidlin, 1906
Schmidlin, M.J.,
Recherches chimiques et thermochimiques sur la constitution des rosanilines,
Ann. Chim. Phys., 1906, 1, 195-256. [all data]
Barker, 1925
Barker, M.F.,
Calorific value and constitution,
J. Phys. Chem., 1925, 29, 1345-1363. [all data]
Parks, Todd, et al., 1936
Parks, G.S.; Todd, S.S.; Moore, W.A.,
Thermal data on organic compounds. XVI. Some heat capacity, entropy and free energy data for typical benzene derivatives and heterocyclic compounds,
J. Am. Chem. Soc., 1936, 58, 398-401. [all data]
Griigo'ev, Yanin, et al., 1979
Griigo'ev, B.A.; Yanin, G.S.; Rastorguev, Yu.L.; Thermophysical parameters of alcohols, Tr. GIAP,
54, 1979, 57-64. [all data]
Nichols and Wads, 1975
Nichols, N.; Wads, I.,
Thermochemistry of solutions of biochemical model compounds. 3. Some benzene derivatives in aqueous solution,
J. Chem. Thermodynam., 1975, 7, 329-336. [all data]
Smith and Andrews, 1931
Smith, R.H.; Andrews, D.H.,
Thermal energy studies. I. Phenyl derivatives of methane,
ethane and some related compounds. J. Am. Chem. Soc., 1931, 53, 3644-3660. [all data]
von Reis, 1881
von Reis, M.A.,
Die specifische Wärme flüssiger organischer Verbindungen und ihre Beziehung zu deren Moleculargewicht,
Ann. Physik [3], 1881, 13, 447-464. [all data]
Weast and Grasselli, 1989
CRC Handbook of Data on Organic Compounds, 2nd Editon, Weast,R.C and Grasselli, J.G., ed(s)., CRC Press, Inc., Boca Raton, FL, 1989, 1. [all data]
Buckingham and Donaghy, 1982
Buckingham, J.; Donaghy, S.M.,
Dictionary of Organic Compounds: Fifth Edition, Chapman and Hall, New York, 1982, 1. [all data]
Grayson and Fosbraey, 2006
Grayson, B. Terence; Fosbraey, Lynda A.,
Determination of the vapour pressure of pesticides,
Pestic. Sci., 2006, 13, 3, 269-278, https://doi.org/10.1002/ps.2780130308
. [all data]
Stephenson and Malanowski, 1987
Stephenson, Richard M.; Malanowski, Stanislaw,
Handbook of the Thermodynamics of Organic Compounds, 1987, https://doi.org/10.1007/978-94-009-3173-2
. [all data]
Kkykj and Repas, 1973
Kkykj, J.; Repas, M.,
Petrochemia, 1973, 13, 179. [all data]
Serpinskii, Voitkevich, et al., 1957
Serpinskii, V.V.; Voitkevich, S.A.; Lyuboshits, N.Yu.,
Zh. Fiz. Khim., 1957, 31, 1278. [all data]
Dreisbach and Shrader, 1949
Dreisbach, R.R.; Shrader, S.A.,
Vapor Pressure--Temperature Data on Some Organic Compounds,
Ind. Eng. Chem., 1949, 41, 12, 2879-2880, https://doi.org/10.1021/ie50480a054
. [all data]
Acree, 1991
Acree, William E.,
Thermodynamic properties of organic compounds: enthalpy of fusion and melting point temperature compilation,
Thermochimica Acta, 1991, 189, 1, 37-56, https://doi.org/10.1016/0040-6031(91)87098-H
. [all data]
Caldwell, Rozeboom, et al., 1984
Caldwell, G.; Rozeboom, M.D.; Kiplinger, J.P.; Bartmess, J.E.,
Anion-alcohol hydrogen bond strengths in the gas phase,
J. Am. Chem. Soc., 1984, 106, 4660. [all data]
Paul and Kebarle, 1990
Paul, G.J.C.; Kebarle, P.,
Thermodynamics of the Association Reactions OH- - H2O = HOHOH- and CH3O- - CH3OH = CH3OHOCH3- in the Gas Phase,
J. Phys. Chem., 1990, 94, 12, 5184, https://doi.org/10.1021/j100375a076
. [all data]
Meot-ner and Sieck, 1986
Meot-ner, M.; Sieck, L.W.,
Relative acidities of water and methanol, and the stabilities of the dimer adducts,
J. Phys. Chem., 1986, 90, 6687. [all data]
Caldwell and Kebarle, 1986
Caldwell, G.; Kebarle, P.,
Mobility of Gaseous Ions in Weak Electric Fields
in Unpublished results, 1986. [all data]
Meot-Ner(Mautner), 1986
Meot-Ner(Mautner), M.,
Comparative Stabilities of Cationic and Anionic Hydrogen-Bonded Networks. Mixed Clusters of Water-Methanol,
J. Am. Chem. Soc., 1986, 108, 20, 6189, https://doi.org/10.1021/ja00280a014
. [all data]
Bartmess, Scott, et al., 1979
Bartmess, J.E.; Scott, J.A.; McIver, R.T., Jr.,
The gas phase acidity scale from methanol to phenol,
J. Am. Chem. Soc., 1979, 101, 6047. [all data]
Meot-ner, 1988
Meot-ner, M.,
The Ionic Hydrogen Bond and Solvation. 7. Interaction Energies of Carbanions with Solvent Molecules,
J. Am. Chem. Soc., 1988, 110, 12, 3858, https://doi.org/10.1021/ja00220a022
. [all data]
Mihalick, Gatev, et al., 1996
Mihalick, J.E.; Gatev, G.G.; Brauman, J.I.,
Electron Photodetachment Spectroscopy of Solvated Anions: RO.HF- or ROH.F-?,
J. Am. Chem. Soc., 1996, 118, 49, 12424, https://doi.org/10.1021/ja954202k
. [all data]
Gellner and Skinner, 1949
Gellner, O.H.; Skinner, H.A.,
Dissociation energies of carbon-halogen bonds. The bond strengths allyl-X and benzyl-X,
J. Chem. Soc., 1949, 1145-1148. [all data]
Cubberley and Mueller, 1946
Cubberley, A.H.; Mueller, M.B.,
Equilibrium studies on the dehydrogenation of primary and secondary alcohols. I. 2-Butanol, 2-octanol, cyclopentanol and benzyl alcohol,
J. Am. Chem. Soc., 1946, 68, 1149-1151. [all data]
Hunter and Lias, 1998
Hunter, E.P.; Lias, S.G.,
Evaluated Gas Phase Basicities and Proton Affinities of Molecules: An Update,
J. Phys. Chem. Ref. Data, 1998, 27, 3, 413-656, https://doi.org/10.1063/1.556018
. [all data]
Selim, Rabbih, et al., 1987
Selim, E.T.; Rabbih, M.A.; Fahmey, M.A.,
M and [M-1]+ ions formed for benzyl alcohol, benzyl amine and benzyl cyanide,
Org. Mass Spectrom., 1987, 22, 381. [all data]
Russell, Freiser, et al., 1983
Russell, D.H.; Freiser, B.S.; McBay, E.H.; Canada, D.C.,
The structure of decomposing [C7H7O]+ ions: Benzyl versus tropylium ion structures,
Org. Mass Spectrom., 1983, 18, 474. [all data]
Gilbert, Leach, et al., 1973
Gilbert, J.R.; Leach, W.P.; Miller, J.R.,
Ionisation appearance potential measurements in arene chromium tricarbonyls,
J. Organomet. Chem., 1973, 49, 219. [all data]
Pignataro, Foffani, et al., 1966
Pignataro, S.; Foffani, A.; Innorta, G.; Distefano, G.,
Molecular structural effects on the ionization potentials for metasubstituted aromatic compounds and for compounds of the type X-CH2-R,
Z. Physik. Chem. (Frankfurt), 1966, 49, 291. [all data]
Ballard, Jones, et al., 1987
Ballard, R.E.; Jones, J.; Read, D.; Inchley, A.; Cranmer, M.,
He(I) photoelectron studies of liquids and gases,
Chem. Phys. Lett., 1987, 137, 125. [all data]
Deshmukh, Dutta, et al., 1982
Deshmukh, P.; Dutta, T.K.; Hwang, J.L.-S.; Housecroft, C.E.; Fehlner, T.P.,
Photoelectron spectroscopic measurements of the relative charge on carbyne fragments bound to polynuclear cobalt carbonyl clusters,
J. Am. Chem. Soc., 1982, 104, 1740. [all data]
Eck, Schweig, et al., 1978
Eck, V.; Schweig, A.; Vermeer, H.,
The ultraviolet photoelectron spectrum of o-benzoquinone methide,
Tetrahedron Lett., 1978, 27, 2433. [all data]
Benoit and Harrison, 1977
Benoit, F.M.; Harrison, A.G.,
Predictive value of proton affinity. Ionization energy correlations involving oxygenated molecules,
J. Am. Chem. Soc., 1977, 99, 3980. [all data]
Selim, Rabbih, et al., 1989
Selim, E.T.M.; Rabbih, M.A.; Fahmey Ahmad, M.A.; Shalbi, A.S.,
Energetic study of [C5H3]+ fragment ion produced from some benzyl derivatives,
Arab Gulf J. Sci. Res., 1989, 7, 53. [all data]
Selim, Rabbih, et al., 1987, 2
Selim, E.T.M.; Rabbih, M.A.; Fahmey, M.A.,
A mass spectrometric study of [C7H7]+ and [C6H7]+ fragment ions obtained from benzyl alcohol, benzyl amine and benzyl cyanide,
Egypt. J. Phys., 1987, 18, 37. [all data]
Harrison, Haynes, et al., 1965
Harrison, A.G.; Haynes, P.; McLean, S.; Meyer, F.,
The mass spectra of methyl-substituted cyclopentadienes,
J. Am. Chem. Soc., 1965, 87, 5099. [all data]
Selim, Rabbih, et al., 1987, 3
Selim, E.T.; Rabbih, M.A.; Rezk, A.M.H.; Fahmey, M.A.,
Energetics of [C7H6]+ fragment ion using electron impact technique,
Indian J. Pure Appl. Phys., 1987, 25, 451. [all data]
Meyerson, Rylander, et al., 1959
Meyerson, S.; Rylander, P.N.; Eliel, E.L.; McCollum, J.D.,
Organic ions in the gas phase. VII. Tropylium ion from benzyl chloride and benzyl alcohol,
J. Am. Chem. Soc., 1959, 81, 2606. [all data]
Kuhn, 2001
Kuhn, E.R.,
Selectivity vs. polarity: the fundamentals of chromatographic separation,
J. Sep. Sci., 2001, 24, 6, 473-476, https://doi.org/10.1002/1615-9314(20010601)24:6<473::AID-JSSC473>3.0.CO;2-Y
. [all data]
Tudor and Moldovan, 1999
Tudor, E.; Moldovan, D.,
Temperature Dependence of the Retention Index for Perfumery Compounds on a Se-30 Glass Capillary Column. II. The Hyperbolic Equation,
J. Chromatogr., 1999, 848, 1-2, 215-227, https://doi.org/10.1016/S0021-9673(99)00412-4
. [all data]
Tudor, 1997
Tudor, E.,
Temperature dependence of the retention index for perfumery compounds on a SE-30 glass capillary column. I. Linear equations,
J. Chromatogr. A, 1997, 779, 1-2, 287-297, https://doi.org/10.1016/S0021-9673(97)00453-6
. [all data]
Cha and Lee, 1994
Cha, K.-W.; Lee, D.-J.,
Prediction of retention indices of various compounds in gas-liquid chromatography,
J. Korean Chem. Soc., 1994, 38, 2, 108-120, retrieved from http://journal.kcsnet.or.kr/publi/dh/dh94n2/108.pdf. [all data]
Korhonen, 1986
Korhonen, I.O.O.,
Gas-Liquid Chromatographic Analyses. XLVIII. Benzyl, (±)-1-Phenylethyl and 2-Phenylethyl Alcohols and the Corresponding Esters of Benzoic Acid and Its 2-, 3- and 4-Chloro, Pentafluoro, 4-Nitro and 3,5-Dinitro Derivatives on SE-30 and OV-351 Capillary Columns,
J. Chromatogr., 1986, 363, 277-292. [all data]
Tiess, 1984
Tiess, D.,
Gaschromatographische Retentionsindices von 125 leicht- bis mittelflüchtigen organischen Substanzen toxikologisch-analytischer Relevanz auf SE-30,
Wiss. Z. Wilhelm-Pieck-Univ. Rostock Math. Naturwiss. Reihe, 1984, 33, 6-9. [all data]
Winskowski, 1983
Winskowski, J.,
Gaschromatographische Identifizierung von Stoffen anhand von Indexziffem und unterschiedlichen Detektoren,
Chromatographia, 1983, 17, 3, 160-165, https://doi.org/10.1007/BF02271041
. [all data]
Wehrli and Kováts, 1959
Wehrli, A.; Kováts, E.,
Gas-chromatographische Charakterisierung ogranischer Verbindungen. Teil 3: Berechnung der Retentionsindices aliphatischer, alicyclischer und aromatischer Verbindungen,
Helv. Chim. Acta, 1959, 7, 7, 2709-2736, https://doi.org/10.1002/hlca.19590420745
. [all data]
Tayoub, Schwob, et al., 2006
Tayoub, G.; Schwob, I.; Bessiere, J.-M.; Masotti, V.; Rabier, J.; Ruzzier, M.; Viano, J.,
Composition of volatile oils of Styrax (Styrax officinalis L.) leaves at different phenological stages,
Biochem. Syst. Ecol., 2006, 34, 9, 705-709, https://doi.org/10.1016/j.bse.2006.05.008
. [all data]
Tayoub, Schwob, et al., 2006, 2
Tayoub, G.; Schwob, I.; Bessière, J.-M.; Rabier, J.; Masotti, V.; J.; M.; Girard, G.; Viano, J.,
Essential oil composition of leaf, flower and stem of Styrax (Styrax officinalis L.) from south-eastern France,
Flavour Fragr. J., 2006, 21, 5, 809-812, https://doi.org/10.1002/ffj.1731
. [all data]
Shawl, Srivastava, et al., 2002
Shawl, A.S.; Srivastava, S.K.; Syamasundar, K.V.; Tripathi, S.; Raina, V.K.,
Essential oil composition of Achillea millefolium L. growing wild in Kashmir, India,
Flavour Fragr. J., 2002, 17, 3, 165-168, https://doi.org/10.1002/ffj.1074
. [all data]
Thangadurai, Anitha, et al., 2002
Thangadurai, D.; Anitha, S.; Pullaiah, T.; Reddy, P.N.; Ramachandraiah, O.S.,
Essential oil constituents and in vitro antimicrobial activity of Decalepis hamiltonii roots against foodborne pathogens,
J. Agric. Food Chem., 2002, 50, 11, 3147-3149, https://doi.org/10.1021/jf011541q
. [all data]
Morales and Duque, 1987
Morales, A.L.; Duque, C.,
Aroma constituents of the fruit of the moutain papaya (Carica pubescens) from Colombia,
J. Agric. Food Chem., 1987, 35, 4, 538-540, https://doi.org/10.1021/jf00076a024
. [all data]
Shibamoto, Kamiya, et al., 1981
Shibamoto, T.; Kamiya, Y.; Mihara, S.,
Isolation and identification of volatile compounds in cooked meat: sukiyaki,
J. Agric. Food Chem., 1981, 29, 1, 57-63, https://doi.org/10.1021/jf00103a015
. [all data]
Yamaguchi and Shibamoto, 1981
Yamaguchi, K.; Shibamoto, T.,
Volatile constituents of green tea, Gyokuro (Camellia sinensis L. var Yabukita),
J. Agric. Food Chem., 1981, 29, 2, 366-370, https://doi.org/10.1021/jf00104a035
. [all data]
Yamaguchi and Shibamoto, 1979
Yamaguchi, K.; Shibamoto, T.,
Volatile constituents of Castanopsis flower,
J. Agric. Food Chem., 1979, 27, 4, 847-850, https://doi.org/10.1021/jf60224a025
. [all data]
Van Durme, Dewulf, et al., 2007
Van Durme, J.; Dewulf, J.; Sysmans, W.; Leys, C.; Van Langenhove, H.,
Abatement and degradation pathways of toluene in indoor air by positive corona discharge,
Chemosphere, 2007, 68, 10, 1821-1829, https://doi.org/10.1016/j.chemosphere.2007.03.053
. [all data]
Wongpornchai, Sriseadka, et al., 2003
Wongpornchai, S.; Sriseadka, T.; Choonvisase, S.,
Identification and quantitation of the rice aroma compound, 2-acetyl-1-pyrroline, in bread flowers (Vallaris glabra Ktze),
J. Agric. Food Chem., 2003, 51, 2, 457-462, https://doi.org/10.1021/jf025856x
. [all data]
Borse, Jagan Mohan Rao, et al., 2002
Borse, B.B.; Jagan Mohan Rao, L.; Nagalakshmi, S.; Krishnamurthy, N.,
Fingerprint of black teas from India: identification of the regio-specific characteristics,
Food Chem., 2002, 79, 4, 419-424, https://doi.org/10.1016/S0308-8146(02)00191-7
. [all data]
Bruce, Cork, et al., 2002
Bruce, T.J.; Cork, A.C.; Hall, D.R.; Dunkelblum, E.,
Laboratory and field evaluation of floral odours from African marigold, Tagetes erecta, and sweet pea, Lathyrus odoratus, as kairomones for the cotton bollworm Helicoverpa armigera, 2002, retrieved from http://phero.net/iobc/samos/bulletin/bruce.pdf. [all data]
Ramsey, Lee, et al., 1980
Ramsey, J.D.; Lee, T.D.; Osselton, M.D.; Moffat, A.C.,
Gas-liquid chromatographic retention indices of 296 non-drug substances on SE-30 or OV-1 likely to be encountered in toxicological analyses,
J. Chromatogr., 1980, 184, 2, 185-206, https://doi.org/10.1016/S0021-9673(00)85641-1
. [all data]
Tudor, Moldovan, et al., 1999
Tudor, E.; Moldovan, D.; Zârna, N.,
Temperature dependence of the retention index for perfumery compounds on two carbowax-20M glass capillary columns with different film thickness. 2,
Rev. Roum. Chim., 1999, 44, 7, 665-675. [all data]
Chandravadana, Vekateshwarlu, et al., 2005
Chandravadana, M.V.; Vekateshwarlu, G.; Bujji Babu, C.S.; Roy, T.K.; Shivashankara, K.S.; Pandey, M.; Tewari, R.P.; Selvaraj, Y.,
Volatile flavour components of dry milky mushrooms (Calocybe indica),
Flavour Fragr. J., 2005, 20, 6, 715-717, https://doi.org/10.1002/ffj.1653
. [all data]
Nagarajan, Rao, et al., 2001
Nagarajan, S.; Rao, L.J.M.; Guirudutt, K.N.,
Chemical composition of the volatiles of Decalepis hamiltonii (Wight Arn),
Flavour Fragr. J., 2001, 16, 1, 27-29, https://doi.org/10.1002/1099-1026(200101/02)16:1<27::AID-FFJ937>3.0.CO;2-F
. [all data]
Venkateshwarlu, Chandravadana, et al., 1999
Venkateshwarlu, G.; Chandravadana, M.V.; Tewari, R.P.,
Volatile flavour components of some edible mushrooms (Basidiomycetes),
Flavour Fragr. J., 1999, 14, 3, 191-194, https://doi.org/10.1002/(SICI)1099-1026(199905/06)14:3<191::AID-FFJ810>3.0.CO;2-7
. [all data]
Wong and Teng, 1994
Wong, K.C.; Teng, Y.E.,
Volatile Components of Mimusops elengi L. Flowers,
J. Essent. Oil Res., 1994, 6, 5, 453-458, https://doi.org/10.1080/10412905.1994.9698425
. [all data]
Tatsuka, Suekane, et al., 1990
Tatsuka, K.; Suekane, S.; Sakai, Y.; Sumitani, H.,
Volatile constituents of kiwi fruit flowers: simultaneous distillation and extraction versus headspace sampling,
J. Agric. Food Chem., 1990, 38, 12, 2176-2180, https://doi.org/10.1021/jf00102a015
. [all data]
Nishimura, Yamaguchi, et al., 1989
Nishimura, O.; Yamaguchi, K.; Mihara, S.; Shibamoto, T.,
Volatile Constituents of Guava Fruits (Psidium guajava L.) and Canned Puree,
J. Agric. Food Chem., 1989, 37, 1, 139-142, https://doi.org/10.1021/jf00085a033
. [all data]
Gaydou, Randriamiharisoa, et al., 1986
Gaydou, E.M.; Randriamiharisoa, R.; Bianchini, J.-P.,
Composition of the essential oil of ylang-ylang (Canaga odorata Hook Fil. et Thomson forma genuina) from Madagascar,
J. Agric. Food Chem., 1986, 34, 3, 481-487, https://doi.org/10.1021/jf00069a028
. [all data]
MacLeod and Pieris, 1983
MacLeod, A.J.; Pieris, N.M.,
Volatile components of papaya (Carica papaya L.) with particular reference to glucosinolate products,
J. Agric. Food Chem., 1983, 31, 5, 1005-1008, https://doi.org/10.1021/jf00119a021
. [all data]
Toda, Mihara, et al., 1983
Toda, H.; Mihara, S.; Umano, K.; Shibamoto, T.,
Photochemical studies on jasmin oil,
J. Agric. Food Chem., 1983, 31, 3, 554-558, https://doi.org/10.1021/jf00117a022
. [all data]
Buttery, Kamm, et al., 1982
Buttery, R.G.; Kamm, J.A.; Ling, L.C.,
Volatile components of alfalfa flowers and pods,
J. Agric. Food Chem., 1982, 30, 4, 739-742, https://doi.org/10.1021/jf00112a028
. [all data]
Brander, Kepner, et al., 1980
Brander, C.F.; Kepner, R.E.; Webb, A.D.,
Identification of Some Volatile Compounds of Wine of Vitis Vinifera Cultivar Pinot Noir,
Am. J. Enol. Vitic, 1980, 31, 1, 69-75. [all data]
Engel and Ratel, 2007
Engel, E.; Ratel, J.,
Correction of the data generated by mass spectrometry analyses of biological tissues: Application to food authentication,
J. Chromatogr. A, 2007, 1154, 1-2, 331-341, https://doi.org/10.1016/j.chroma.2007.02.012
. [all data]
Pang T., Zhu S., et al., 2007
Pang T.; Zhu S.; Lu X.; Xu G.,
Identification of unknown compounds on the basis of retention index data in comprehensive two-dimensional gas chromatography,
J. Sep. Sci., 2007, 30, 6, 868-874, https://doi.org/10.1002/jssc.200600471
. [all data]
Zeng, Zhao, et al., 2007
Zeng, Y.-X.; Zhao, C.-X.; Liang, Y.-Z.; Yang, H.; Fang, H.-Z.; Yi, L.-Z.; Zeng, Z.-D.,
Comparative analysis of volatile components from Clematis species growing in China,
Anal. Chim. Acta., 2007, 595, 1-2, 328-339, https://doi.org/10.1016/j.aca.2006.12.022
. [all data]
Mahadevan and Farmer, 2006
Mahadevan, K.; Farmer, L.,
Key Odor Impact Compounds in Three Yeast Extract Pastes,
J. Agric. Food Chem., 2006, 54, 19, 7242-7250, https://doi.org/10.1021/jf061102x
. [all data]
Osorio, Alarcon, et al., 2006
Osorio, C.; Alarcon, M.; Moreno, C.; Bonilla, A.; Barrios, J.; Garzon, C.; Duque, C.,
Characterization of Odor-Active Volatiles in Champa ( Campomanesia lineatifolia R. P.),
J. Agric. Food Chem., 2006, 54, 2, 509-516, https://doi.org/10.1021/jf052098c
. [all data]
Zhao C.X., Li, et al., 2006
Zhao C.X.; Li, X.N.; Liang Y.Z.; Fang H.Z.; Huang L.F.; Guo F.Q.,
Comparative analysis of chemical components of essential oils from different samples of Rhododendron with the help of chemometrics methods,
Chemom. Intell. Lab. Syst., 2006, 82, 1-2, 218-228, https://doi.org/10.1016/j.chemolab.2005.08.008
. [all data]
Zhao, Wang X.Y., et al., 2006
Zhao, Y.P.; Wang X.Y.; Wang, Z.C.; Lu Y.; Fu, C.X.; Chen, S.Y.,
Essential oil of Actinidia macrosperma, a catnip response kiwi endemic to China,
Journal of Zhejiang University SCIENCE B, 2006, 7, 9, 708-712, https://doi.org/10.1631/jzus.2006.B0708
. [all data]
Alves, Pinto, et al., 2005
Alves, R.J.V.; Pinto, A.C.; da Costa, A.V.M.; Rezende, C.M.,
Zizyphus mauritiana Lam. (Rhamnaceae) and the chemical composition of its floral fecal odor,
J. Braz. Chem. Soc., 2005, 16, 3B, 654-656, https://doi.org/10.1590/S0103-50532005000400027
. [all data]
bin Jantan, Yalvema, et al., 2005
bin Jantan, I.; Yalvema, M.F.; Ahmad, N.W.; Jamal, J.A.,
Insecticidal activities of the leaf oils of eight Cinnamomum species against Aedes aegypti and Aedes albopictus,
Pharm. Biol., 2005, 43, 6, 526-532, https://doi.org/10.1080/13880200500220771
. [all data]
Pino, Mesa, et al., 2005
Pino, J.A.; Mesa, J.; Muñoz, Y.; Martí, M.P.; Marbot, R.,
Volatile components from mango (Mangifera indica L.) cultivars,
J. Agric. Food Chem., 2005, 53, 6, 2213-2223, https://doi.org/10.1021/jf0402633
. [all data]
Zhao, Liang, et al., 2005
Zhao, C.-X.; Liang, Y.-Z.; Fang, H.-Z.; Li, X.-N.,
Temperature-programmed retention indices for gas chromatography-mass spectroscopy analysis of plant essential oils,
J. Chromatogr. A, 2005, 1096, 1-2, 76-85, https://doi.org/10.1016/j.chroma.2005.09.067
. [all data]
Dickschat, Wenzel, et al., 2004
Dickschat, J.S.; Wenzel, S.C.; Bode, H.B.; Muller, R.; Schulz, S.,
Biosynthesis of Volatiles by the Myxobacterium Myxococcus xanthus,
ChemBioChem, 2004, 5, 6, 778-787, https://doi.org/10.1002/cbic.200300813
. [all data]
Píno, Marbot, et al., 2004
Píno, J.A.; Marbot, R.; Vázquez, C.,
Volatile components of the fruits of Vangueria madagascariensis J. F. Gmel. from Cuba,
J. Essent. Oil Res., 2004, 16, 4, 302-304, https://doi.org/10.1080/10412905.2004.9698727
. [all data]
Pino, Marbot, et al., 2004
Pino, J.A.; Marbot, R.; Vazquez, C.,
Volatile components of tamarind (Tamarindus indica L.) grown in Cuba,
J. Essent. Oil Res., 2004, 16, 4, 318-320, https://doi.org/10.1080/10412905.2004.9698731
. [all data]
Pino, Marbot, et al., 2004, 2
Pino, J.A.; Marbot, R.; Rosado, A.; Vázquez, C.,
Volatile constituents of Malay rose apple [Syzygium malaccense (L.) Merr. Perry],
Flavour Fragr. J., 2004, 19, 1, 32-35, https://doi.org/10.1002/ffj.1269
. [all data]
Raina, Kumar, et al., 2004
Raina, V.K.; Kumar, A.; Srivastava, S.K.; Syamsundar, K.V.; Kahol, A.P.,
Essential oil composition of 'kewda' (Pandanus odoratissimus) from India,
Flavour Fragr. J., 2004, 19, 5, 434-436, https://doi.org/10.1002/ffj.1331
. [all data]
Reis, Pansarim, et al., 2004
Reis, M.G.; Pansarim, E.R.; da Silva, U.F.; Estanislau do Amaral, M.C.; Marsaioli, A.J.,
Pollinator attraction devices (floral fragrances) of some Brazilian orchids,
Arkivoc, 2004, 6, 89-97. [all data]
Siegmund and Murkovic, 2004
Siegmund, B.; Murkovic, M.,
Changes in chemical composition of pumpkin seeds during the roasting process for production of pumpkin seed oil (Part 2: volatile compounds),
Food Chem., 2004, 84, 3, 367-374, https://doi.org/10.1016/S0308-8146(03)00241-3
. [all data]
Singer, Flach, et al., 2004
Singer, R.B.; Flach, A.; Koehler, S.; Marsaioli, A.J.; Amaral, M.C.E.,
Sexual Mimicry in Mormolyca ringens (Lindl.) Schltr. (Orchidaceae: Maxillariinae),
Ann. Bot. Rome, 2004, 93, 6, 755-762, https://doi.org/10.1093/aob/mch091
. [all data]
Cavalli, Fernandez, et al., 2003
Cavalli, J.-F.; Fernandez, X.; Lizzani-Cuvelier, L.; Loiseau, A.-M.,
Comparison of static headspace, headspace solid phase microextraction, headspace sorptive extraction, and direct thermal desorption techniques on chemical composition of French olive oils,
J. Agric. Food Chem., 2003, 51, 26, 7709-7716, https://doi.org/10.1021/jf034834n
. [all data]
Isidorov and Vinogorova, 2003
Isidorov, V.A.; Vinogorova, V.T.,
GC-MS analysis of compounds extracted from buds of Populus balsamifera and Populus nigra,
Z. Naturforsch. C:, 2003, 58, 355-360. [all data]
Lalel, Singh, et al., 2003
Lalel, H.J.D.; Singh, Z.; Chye Tan, S.,
Glycosidically-bound aroma volatile compounds in the skin and pulp of 'Kensington Pride' mango fruit at different stages of maturity,
Postharvest Biol. Technol., 2003, 29, 2, 205-218, https://doi.org/10.1016/S0925-5214(02)00250-8
. [all data]
Pino, Almora, et al., 2003
Pino, J.; Almora, K.; Marbot, R.,
Volatile components of papaya (Carica papaya L., maradol variety) fruit,
Flavour Fragr. J., 2003, 18, 6, 492-496, https://doi.org/10.1002/ffj.1248
. [all data]
Pino, Marbot, et al., 2002
Pino, J.; Marbot, R.; Rosado, A.,
Volatile constituents of star apple (Chrysophyllum cainito L.) from Cuba,
Flavour Fragr. J., 2002, 17, 5, 401-403, https://doi.org/10.1002/ffj.1116
. [all data]
Kim, Shin, et al., 2001
Kim, T.H.; Shin, J.H.; Baek, H.H.; Lee, H.J.,
Volatile flavour compounds in suspension culture of Agastache rugosa Kuntze (Korean mint),
J. Sci. Food Agric., 2001, 81, 6, 569-575, https://doi.org/10.1002/jsfa.845
. [all data]
de Lacy Costello, Evans, et al., 2001
de Lacy Costello, B.P.J.; Evans, P.; Ewen, R.J.; Gunson, H.E.; Jones, P.R.H.; Ratcliffe, N.M.; Spencer-Phillips, P.T.N.,
Gas chromatography-mass spectrometry analyses of volatile organic compounds from potato tubers inoculated with Phytophthora infestans or Fusarium coeruleum,
Plant Pathol., 2001, 50, 4, 489-496, https://doi.org/10.1046/j.1365-3059.2001.00594.x
. [all data]
Nogueira, Bittrich, et al., 2001
Nogueira, P.C.L.; Bittrich, V.; Shepherd, G.J.; Lopes, A.V.; Marsaioli, A.J.,
The ecological and taxonomic importance of flower volatiles of Clusia species (Guttiferae),
Phytochemistry, 2001, 56, 5, 443-452, https://doi.org/10.1016/S0031-9422(00)00213-2
. [all data]
Yin, Xiu, et al., 2001
Yin, W.; Xiu, Z.; Aijin, H.,
Analysis of the volatile components in trogopterorum feces by capillary gas chromatography and gas chromatography/mass spectrometry,
Fenxi Huaxue, 2001, 29, 2, 195-198. [all data]
David, Scanlan, et al., 2000
David, F.; Scanlan, F.; Sandra, P.,
Retention time locking in flavor analysis, Proceedings 23rd ISCC; CD-ROM, 2000, retrieved from http://www.richrom.com/assets/CD23PDF. [all data]
Chassagne, Boulanger, et al., 1999
Chassagne, D.; Boulanger, R.; Crouzet, J.,
Enzymatic hydrolysis of edible Passiflora fruit glycosides,
Food Chem., 1999, 66, 3, 281-288, https://doi.org/10.1016/S0308-8146(99)00044-8
. [all data]
Li, Wang, et al., 1998
Li, W.; Wang, H.; Sun, Y.; Huang, A.; Sun, Y.,
Capillary gas chromatographic analysis of volatile components in goat feces,
Fenxi Huaxue, 1998, 26, 8, 935-939. [all data]
Sakho, Chassagne, et al., 1997
Sakho, M.; Chassagne, D.; Crouzet, J.,
African mango glycosidically bound volatile compounds,
J. Agric. Food Chem., 1997, 45, 3, 883-888, https://doi.org/10.1021/jf960277b
. [all data]
Gautzsch and Zinn, 1996
Gautzsch, R.; Zinn, P.,
Use of incremental models to estimate the retention indexes of aromatic compounds,
Chromatographia, 1996, 43, 3/4, 163-176, https://doi.org/10.1007/BF02292946
. [all data]
Stashenko, Prada, et al., 1996
Stashenko, E.E.; Prada, N.Q.; Martínez, J.R.,
HRGC/FID/NP and HRGC/MSD study of Colombian Ylang-Ylang (Cananga odorata) oils obtained by different extraction techniques,
J. Hi. Res. Chromatogr., 1996, 19, 6, 353-358, https://doi.org/10.1002/jhrc.1240190609
. [all data]
Coen, Engel, et al., 1995
Coen, M.; Engel, R.; Nahrstedt, A.,
Chavicol β-D-glucoside, a phenylpropanoid heteroside, benzyl-β-D-glucoside and glycosidically bound volatiles from subspecies of Cedronella canariensis,
Phytochemistry, 1995, 40, 1, 149-155, https://doi.org/10.1016/0031-9422(95)00241-X
. [all data]
Adedeji, Hartman, et al., 1992
Adedeji, J.; Hartman, T.G.; Lech, J.; Ho, C.-T.,
Characterization of glycosidically bound aroma compounds in the African Mango (Mangifera indica L.),
J. Agric. Food Chem., 1992, 40, 4, 659-661, https://doi.org/10.1021/jf00016a028
. [all data]
Yang, Sugisawa, et al., 1992
Yang, R.; Sugisawa, H.; Nakatani, H.; Tamura, H.; Takagi, N.,
Comparison of odor quality in peel oils of acid citrus,
Nippon Shokuhin Kogyo Gakkaishi, 1992, 39, 1, 16-24, https://doi.org/10.3136/nskkk1962.39.16
. [all data]
Shapi and Hesso, 1990
Shapi, M.M.; Hesso, A.,
Thermal decomposition of polystyrene volatile compounds from large-scale pyrolysis,
J. Anal. Appl. Pyrolysis, 1990, 18, 2, 143-161, https://doi.org/10.1016/0165-2370(90)80004-8
. [all data]
Chang, Sheng, et al., 1989
Chang, L.P.; Sheng, L.S.; Yang, M.Z.; An, D.K.,
Retention index of essential oil in temperature-programmed capillary column gas chromatography,
Acta Pharm. Sin., 1989, 24, 11, 847-852. [all data]
Tan, Wilkins, et al., 1989
Tan, S.T.; Wilkins, A.L.; Holland, P.T.; McGhie, T.K.,
Extractives from New Zealand unifloral honeys. 2. Degraded carotenoids and other substances from heather honey,
J. Agric. Food Chem., 1989, 37, 5, 1217-1221, https://doi.org/10.1021/jf00089a004
. [all data]
Guichard and Souty, 1988
Guichard, E.; Souty, M.,
Comparison of the relative quantities of aroma compounds found in fresh apricot (Prunus armeniaca) from six different varieties,
Z. Lebensm. Unters. Forsch., 1988, 186, 4, 301-307, https://doi.org/10.1007/BF01027031
. [all data]
Misharina, Vitt, et al., 1986
Misharina, T.A.; Vitt, S.V.; Golovnya, R.V.; Belikov, V.M.,
The use of chemical modification for combined chromatographic-mass spectrometric identification of isomeric thiophene and furan substances,
Zh. Anal. Khim., 1986, 61, 10, 1876-1881. [all data]
Halket and Schulten, 1985
Halket, J.M.; Schulten, H.-R.,
Thick-film capillary column gas chromatography-field ionization mass spectrometry: A complementary technique for the rapid analysis of volatiles,
J. Chromatogr., 1985, 322, 200-205, https://doi.org/10.1016/S0021-9673(01)97672-1
. [all data]
Schreyen, Dirinck, et al., 1976
Schreyen, L.; Dirinck, P.; van Wassenhove, F.; Schamp, N.,
Analysis of leek volatiles by headspace condensation,
J. Agric. Food Chem., 1976, 24, 6, 1147-1152, https://doi.org/10.1021/jf60208a023
. [all data]
Schreyen, Dirinck, et al., 1976, 2
Schreyen, L.; Dirinck, P.; van Wassenhove, F.; Schamp, N.,
Volatile flavor components of leek,
J. Agric. Food Chem., 1976, 24, 2, 336-341, https://doi.org/10.1021/jf60204a056
. [all data]
van den Dool and Kratz, 1963
van den Dool, H.; Kratz, P. Dec.,
A generalization of the retention index system including linear temperature programmed gas-liquid partition chromatography,
J. Chromatogr., 1963, 11, 463-471, https://doi.org/10.1016/S0021-9673(01)80947-X
. [all data]
Andrade, Sampaio, et al., 2007
Andrade, M.S.; Sampaio, T.S.; Nogueira, P.C.L.; Ribeiro, A.S.; Bittrich, V.; Amaral, M.C.E.,
Volatile compounds of the leaves, flowers and fruits of Kielmeyera rugosa Choisy (Clusiaceae),
Flavour Fragr. J., 2007, 22, 1, 49-52, https://doi.org/10.1002/ffj.1751
. [all data]
Sampaio and Nogueira, 2006
Sampaio, T.S.; Nogueira, P.C.L.,
Volatile components of mangaba fruit (Hancornia speciosa Gomes) at three stages of maturity,
Food Chem., 2006, 95, 4, 606-610, https://doi.org/10.1016/j.foodchem.2005.01.038
. [all data]
Varlet V., Knockaert C., et al., 2006
Varlet V.; Knockaert C.; Prost C.; Serot T.,
Comparison of odor-active volatile compounds of fresh and smoked salmon,
J. Agric. Food Chem., 2006, 54, 9, 3391-3401, https://doi.org/10.1021/jf053001p
. [all data]
Sacchetti, Maietti, et al., 2005
Sacchetti, G.; Maietti, S.; Muzzoli, M.; Scaglianti, M.; Manfredini, S.; Radice, M.; Bruni, R.,
Comparative evaluation of 11 essential oils of different origin as functional antioxidants, antiradicals and antimicrobials in foods,
Food Chem., 2005, 91, 4, 621-632, https://doi.org/10.1016/j.foodchem.2004.06.031
. [all data]
Klesk, Qian, et al., 2004
Klesk, K.; Qian, M.; Martin, R.R.,
Aroma extract dilution analysis of cv. meeker (Rubus idaeus L.) red raspberries from Oregon and Washington,
J. Agric. Food Chem., 2004, 52, 16, 5155-5161, https://doi.org/10.1021/jf0498721
. [all data]
Klesk and Qian, 2003
Klesk, K.; Qian, M.,
Aroma extract dilution analysis of Cv. Marion (Rubus spp. hyb) and Cv. Evergreen (R. Iaciniatus L.) blackberries,
J. Agric. Food Chem., 2003, 51, 11, 3436-3441, https://doi.org/10.1021/jf0262209
. [all data]
Beaulieu and Grimm, 2001
Beaulieu, J.C.; Grimm, C.C.,
Identification of volatile compounds in cantaloupe at various developmental stages using solid phase microextraction,
J. Agric. Food Chem., 2001, 49, 3, 1345-1352, https://doi.org/10.1021/jf0005768
. [all data]
Boulanger and Crouzet, 2001
Boulanger, R.; Crouzet, J.,
Identification of the aroma components of acerola (Malphigia glabra L.): free and bound flavor compounds,
Food Chem., 2001, 74, 2, 209-216, https://doi.org/10.1016/S0308-8146(01)00128-5
. [all data]
Boulanger and Crouzet, 2000
Boulanger, R.; Crouzet, J.,
Free and bound flavour components of Amazonian fruits: 2. cupuacu volatile compounds,
Flavour Fragr. J., 2000, 15, 4, 251-257, https://doi.org/10.1002/1099-1026(200007/08)15:4<251::AID-FFJ905>3.0.CO;2-2
. [all data]
Boulanger and Crouzet, 2000, 2
Boulanger, R.; Crouzet, J.,
Free and bound flavour components of Amazonian fruits: 3-glycosidically bound components of cupuacu,
Food Chem., 2000, 70, 4, 463-470, https://doi.org/10.1016/S0308-8146(00)00112-6
. [all data]
Boulanger, Chassagne, et al., 1999
Boulanger, R.; Chassagne, D.; Crouzet, J.,
Free and bound flavour components of amazonian fruits. 1: Bacuri,
Flavour Fragr. J., 1999, 14, 5, 303-311, https://doi.org/10.1002/(SICI)1099-1026(199909/10)14:5<303::AID-FFJ834>3.0.CO;2-C
. [all data]
Yasuhara, Shiraishi, et al., 1997
Yasuhara, A.; Shiraishi, H.; Nishikawa, M.; Yamamoto, T.; Uehiro, T.; Nakasugi, O.; Okumura, T.; Kenmotsu, K.; Fukui, H.; Nagase, M.; Ono, Y.; Kawagoshi, Y.; Baba, K.; Noma, Y.,
Determination of organic components in leachates from hazardous waste disposal sites in Japan by gas chromatography-mass spectrometry,
J. Chromatogr. A, 1997, 774, 1-2, 321-332, https://doi.org/10.1016/S0021-9673(97)00078-2
. [all data]
Mondello, Dugo, et al., 1995
Mondello, L.; Dugo, P.; Basile, A.; Dugo, G.,
Interactive use of linear retention indices, on polar and apolar columns, with a MS-library for reliable identification of complex mixtures,
J. Microcolumn Sep., 1995, 7, 6, 581-591, https://doi.org/10.1002/mcs.1220070605
. [all data]
Sing, Smadja, et al., 1992
Sing, A.S.C.; Smadja, J.; Brevard, H.; Maignial, L.; Chaintreau, A.; Marion, J.-P.,
Volatile constituents of faham (Jumellea fragrans (Thou.) Schltr.),
J. Agric. Food Chem., 1992, 40, 4, 642-646, https://doi.org/10.1021/jf00016a024
. [all data]
Peng, Ding, et al., 1988
Peng, C.T.; Ding, S.F.; Hua, R.L.; Yang, Z.C.,
Prediction of Retention Indexes I. Structure-Retention Index Relationship on Apolar Columns,
J. Chromatogr., 1988, 436, 137-172, https://doi.org/10.1016/S0021-9673(00)94575-8
. [all data]
Aubert and Chanforan, 2007
Aubert, C.; Chanforan, C.,
Postharvest Changes in Physicochemical Properties and Volatile Constituents of Apricot (Prunus armeniaca L.). Characterization of 28 Cultivars,
J. Agric. Food Chem., 2007, 55, 8, 3074-3082, https://doi.org/10.1021/jf063476w
. [all data]
Politeo, Jukic, et al., 2007
Politeo, O.; Jukic, M.; Milos, M.,
Chemical Composition and Antioxidant Activity of Free Volatile Aglycones from Laurel (Laurus nobilis L.) Compared to Its Essential Oil,
Croatica Chem. Acta, 2007, 80, 1, 121-126. [all data]
Pozo-Bayon M.A., Ruiz-Rodriguez A., et al., 2007
Pozo-Bayon M.A.; Ruiz-Rodriguez A.; Pernin K.; Cayot N.,
Influence of eggs on the aroma composition of a sponge cake and on the aroma release in model studies on flavored sponge cakes,
J. Agric. Food Chem., 2007, 55, 4, 1418-1426, https://doi.org/10.1021/jf062203y
. [all data]
Aubert C. and Pitrat M., 2006
Aubert C.; Pitrat M.,
Volatile compounds in the skin and pulp of Queen Anne's pocket melon,
J. Agric. Food Chem., 2006, 54, 21, 8177-8182, https://doi.org/10.1021/jf061415s
. [all data]
Cho, Choi, et al., 2006
Cho, I.H.; Choi, H.-K.; Kim, Y.-S.,
Difference in the volatile composition of pine-mushrooms (Tricholoma matsutake Sing.) according to their grades,
J. Agric. Food Chem., 2006, 54, 13, 4820-4825, https://doi.org/10.1021/jf0601416
. [all data]
Gurbuz O., Rouseff J.M., et al., 2006
Gurbuz O.; Rouseff J.M.; Rouseff R.L.,
Comparison of aroma volatiles in commercial Merlot and Cabernet Sauvignon wines using gas chromatography - Olfactometry and gas chromatography - Mass spectrometry,
J. Agric. Food Chem., 2006, 54, 11, 3990-3996, https://doi.org/10.1021/jf053278p
. [all data]
Lee, Lee, et al., 2006
Lee, S.-J.; Lee, J.-E.; Kim, H.-W.; Kim, S.-S.; Koh, K.-H.,
Development of Korean red wines using Vitis labrusca varieties: instrumental and sensory characterization,
Food Chem., 2006, 94, 3, 385-393, https://doi.org/10.1016/j.foodchem.2004.11.035
. [all data]
Chung, Fung, et al., 2005
Chung, H.Y.; Fung, P.K.; Kim, J.-S.,
Aroma impact components in commercial plain sufu,
J. Agric. Food Chem., 2005, 53, 5, 1684-1691, https://doi.org/10.1021/jf048617d
. [all data]
Cros S., Lignot B., et al., 2005
Cros S.; Lignot B.; Bourseau P.; Jaouen P.,
Reverse osmosis for the production of aromatic concentrates from mussel cooking juices: a technical assessment,
Desalination, 2005, 180, 1-3, 263-269, https://doi.org/10.1016/j.desal.2005.01.008
. [all data]
Cros, Lignot, et al., 2005
Cros, S.; Lignot, B.; Bourseau, P.; Jaouen, P.; Prost, C.,
Desalination of mussel cooking juices by electrodialysis: effect on the aroma profile,
J. Food Eng., 2005, 69, 4, 425-436, https://doi.org/10.1016/j.jfoodeng.2004.08.036
. [all data]
Fang and Qian, 2005
Fang, Y.; Qian, M.,
Aroma compounds in Oregon Pinot Noir wine determined by aroma extract dilution analysis (AEDA),
Flavour Fragr. J., 2005, 20, 1, 22-29, https://doi.org/10.1002/ffj.1551
. [all data]
Verzera, Campisi, et al., 2005
Verzera, A.; Campisi, S.; Zappalá, M.,
SUPELCO. Using SPME-GC-MS to characterize volatile components of honey as indicators of botanical origin, 2005, retrieved from http://www.sigmaaldrich.com/Brands/SupelcoHome/TheReporter.html. [all data]
Aubert and Bourger, 2004
Aubert, C.; Bourger, N.,
Investigation of volatiles in charentais cantaloupe melons (Cucumis melo Var. cantalupensis). Characterization of aroma constituents in some cultivars,
J. Agric. Food Chem., 2004, 52, 14, 4522-4528, https://doi.org/10.1021/jf049777s
. [all data]
Ledauphin, Saint-Clair, et al., 2004
Ledauphin, J.; Saint-Clair, J.-F.; Lablanquie, O.; Guichard, H.; Founier, N.; Guichard, E.; Barillier, D.,
Identification of trace volatile compounds in freshly distilled calvados and cognac using preparative separations coupled with gas chromatography-mass spectrometry,
J. Agric. Food Chem., 2004, 52, 16, 5124-5134, https://doi.org/10.1021/jf040052y
. [all data]
Ménager, Jost, et al., 2004
Ménager, I.; Jost, M.; Aubert, C.,
Changes in physicochemical characteristics and volatile constituents of strawberry (Cv. Cigaline) during maturation,
J. Agric. Food Chem., 2004, 52, 5, 1248-1254, https://doi.org/10.1021/jf0350919
. [all data]
Varming, Andersen, et al., 2004
Varming, C.; Andersen, M.L.; Poll, L.,
Influence of thermal treatment on black currant (Ribes nigrum L.) juice aroma,
J. Agric. Food Chem., 2004, 52, 25, 7628-7636, https://doi.org/10.1021/jf049435m
. [all data]
Varming, Petersen, et al., 2004
Varming, C.; Petersen, M.A.; Poll, L.,
Comparison of isolation methods for the determination of important aroma compounds in black currant (Ribes nigrum L.) juice, using nasal impact frequency profiling,
J. Agric. Food Chem., 2004, 52, 6, 1647-1652, https://doi.org/10.1021/jf035133t
. [all data]
Aubert, Ambid, et al., 2003
Aubert, C.; Ambid, C.; Baumes, R.; Günata, Z.,
Investigation of bound aroma constituents of yellow-fleshed nectarines (Prunus persica L. Cv. Springbright). Changes in bound aroma profile during maturation,
J. Agric. Food Chem., 2003, 51, 21, 6280-6286, https://doi.org/10.1021/jf034613h
. [all data]
Aubert, Günata, et al., 2003
Aubert, C.; Günata; Ambid, C.; Baumes, R.,
Changes in physicochemical characteristics and volatile constituents of yellow- and white-fleshed nectarines during maturation and artificial ripening,
J. Agric. Food Chem., 2003, 51, 10, 3083-3091, https://doi.org/10.1021/jf026153i
. [all data]
Bonvehi and Coll, 2003
Bonvehi, J.S.; Coll, F.V.,
Flavour index and aroma profiles of fresh and processed honeys,
J. Sci. Food Agric., 2003, 83, 4, 275-282, https://doi.org/10.1002/jsfa.1308
. [all data]
Chyau, Ko, et al., 2003
Chyau, C.-C.; Ko, P.-T.; Chang, C.-H.; Mau, J.-L.,
Free and glycosidically bound aroma compounds in lychee (Litchi chinensis Sonn.),
Food Chem., 2003, 80, 3, 387-392, https://doi.org/10.1016/S0308-8146(02)00278-9
. [all data]
Cros, Vandanjon, et al., 2003
Cros, S.; Vandanjon, L.; Jaouen, P.; Bourseau, P.,
Processing of industrial mussel cooking juices by reverse osmosis: pollution abatement and aromas recovery, 2003, retrieved from http://www.membrane.unsw.edu.au/imstec03/content/papers/DAI/imstec064.pdf. [all data]
Jerkovic, Mastelic, et al., 2003
Jerkovic, I.; Mastelic, J.; Milos, M.; Juteau, F.; Masotti, V.; Viano, J.,
Chemical variability of Artemisia vulgaris L. essential oils originated from the Mediterranean area of France and Croatia,
Flavour Fragr. J., 2003, 18, 5, 436-440, https://doi.org/10.1002/ffj.1246
. [all data]
Chung, Yung, et al., 2002
Chung, H.-Y.; Yung, I.K.S.; Ma, W.C.J.; Kim, J.-S.,
Analysis of volatile components in frozen and dried scallops (Patinopecten yessoensis) by gas chromatography/mass spectrometry,
Food Res. Int., 2002, 35, 1, 43-53, https://doi.org/10.1016/S0963-9969(01)00107-7
. [all data]
Claudela, Dirningera, et al., 2002
Claudela, P.; Dirningera, N.; Etievant, P.,
Effects of water on gas chromatographic column efficiency measurements applied to on-column injections of volatile aroma compounds,
J. Sep. Sci., 2002, 25, 5-6, 365-370, https://doi.org/10.1002/1615-9314(20020401)25:5/6<365::AID-JSSC365>3.0.CO;2-Y
. [all data]
Moreira, Trugo, et al., 2002
Moreira, R.F.A.; Trugo, L.C.; Pietroluongo, M.; de Maria, C.A.B.,
Flavor composition of cashew (Anacardium occidentale) and marmeleiro (Croton species) honeys,
J. Agric. Food Chem., 2002, 50, 26, 7616-7621, https://doi.org/10.1021/jf020464b
. [all data]
Adamiec, Rossner, et al., 2001
Adamiec, J.; Rossner, J.; Velisek, J.; Cejpek, K.; Savel, J.,
Minor Strecker degradation products of phenylalanine and phenylglycine,
Eur. Food Res. Technol., 2001, 212, 2, 135-140, https://doi.org/10.1007/s002170000234
. [all data]
Chung, Yung, et al., 2001
Chung, H.Y.; Yung, I.K.S.; Kim, J.-S.,
Comparison of volatile components in dried scallops (Chlamys farreri and Patinopecten yessoensis) prepared by boiling and steaming methods,
J. Agric. Food Chem., 2001, 49, 1, 192-202, https://doi.org/10.1021/jf000692a
. [all data]
Kim, 2001
Kim, J.S.,
Einfluss der Temperatur beim Rösten von Sesam auf Aroma und antioxidative Eigenschaften des Öls, PhD Thesis, Technischen Universität Berlin zur Erlangung des akademischen Grades, Berlin, 2001, 151. [all data]
Verzera, Campisi, et al., 2001
Verzera, A.; Campisi, S.; Zappalá, M.; Bonaccorsi, I.,
SPME-GC-MS analysis of honey volatile components for the characterization of different floral origin,
Am. Lab. Fairfield Conn., 2001, 33, 15, 18-21. [all data]
Wirth, Guo, et al., 2001
Wirth, J.; Guo, W.; Baumes, R.; Günata, Z.,
Volatile compounds released by enzymatic hydrolysis of glycoconjugates of leaves and grape berries from Vitis vinifera muscat of Alexandria and Shiraz cultivars,
J. Agric. Food Chem., 2001, 49, 6, 2917-2923, https://doi.org/10.1021/jf001398l
. [all data]
Bureau, Baumes, et al., 2000
Bureau, S.M.; Baumes, R.L.; Razungles, A.J.,
Effects of vine or bunch shading on the glycosylated flavor precursors in grapes of Vitis vinifera L. Cv. Syrah,
J. Agric. Food Chem., 2000, 48, 4, 1290-1297, https://doi.org/10.1021/jf990507x
. [all data]
Bureau, Razungles, et al., 2000
Bureau, S.M.; Razungles, A.R.; Baumes, R.L.,
The aroma of Muscat of Frontignan grapes: effect of the light environment of vine or bunch on volatiles and glycoconjugates,
J. Sci. Food Agric., 2000, 80, 14, 2012-2020, https://doi.org/10.1002/1097-0010(200011)80:14<2012::AID-JSFA738>3.0.CO;2-X
. [all data]
Charles, Martin, et al., 2000
Charles, M.; Martin, B.; Ginies, C.; Etievant, P.; Coste, G.; Guichard, E.,
Potent aroma compounds of two red wine vinegars,
J. Agric. Food Chem., 2000, 48, 1, 70-77, https://doi.org/10.1021/jf9905424
. [all data]
Chung, 2000
Chung, H.Y.,
Volatile flavor components in red fermented soybean (Glycine max) curds,
J. Agric. Food Chem., 2000, 48, 5, 1803-1809, https://doi.org/10.1021/jf991272s
. [all data]
Christensen, Jakobsen, et al., 1999
Christensen, L.P.; Jakobsen, H.B.; Paulsen, E.; Hodal, L.; Andersen, K.E.,
Airborne compositae dermatitis: monoterpenes and no parthenolide are released from flowering Tanacetum parthenium (feverfew) plants,
Arch. Dermatol. Res., 1999, 291, 7-8, 425-431, https://doi.org/10.1007/s004030050433
. [all data]
Chung, 1999
Chung, H.Y.,
Volatile components in crabmeats of Charybdis feriatus,
J. Agric. Food Chem., 1999, 47, 6, 2280-2287, https://doi.org/10.1021/jf981027t
. [all data]
Chung, 1999, 2
Chung, H.Y.,
Volatile components in fermented soybean (Glycine max) curds,
J. Agric. Food Chem., 1999, 47, 7, 2690-2696, https://doi.org/10.1021/jf981166a
. [all data]
Ollé, Baumes, et al., 1998
Ollé, D.; Baumes, R.L.; Bayonove, C.L.; Lozano, Y.F.; Sznaper, C.; Brillouet, J.-M.,
Comparison of free and glycosidically linked volatile components from polyembryonic and monoembryonic mango (Mangifera indica L.) cultivars,
J. Agric. Food Chem., 1998, 46, 3, 1094-1100, https://doi.org/10.1021/jf9705781
. [all data]
Christensen, Jakobsen, et al., 1997
Christensen, L.P.; Jakobsen, H.B.; Kristiansen, K.; Møller, J.,
Volatiles emitted from flowers of γ-radiated and nonradiated Jasminum polyanthum Franch. in Situ,
J. Agric. Food Chem., 1997, 45, 6, 2199-2203, https://doi.org/10.1021/jf960961q
. [all data]
Mau and Hwang, 1997
Mau, J.-L.; Hwang, S.-J.,
Effect of γ-irradiation on flavor compounds of fresh mushrooms,
J. Agric. Food Chem., 1997, 45, 5, 1849-1852, https://doi.org/10.1021/jf960560a
. [all data]
Shimoda, Nakada, et al., 1997
Shimoda, M.; Nakada, Y.; Nakashima, M.; Osajima, Y.,
Quantitative comparison of volatile flavor compounds in deep-roasted and light-roasted sesame seed oil,
J. Agric. Food Chem., 1997, 45, 8, 3193-3196, https://doi.org/10.1021/jf970172o
. [all data]
Shimoda, Shiratsuchi, et al., 1996
Shimoda, M.; Shiratsuchi, H.; Nakada, Y.; Wu, Y.; Osajima, Y.,
Identification and sensory characterization of volatile flavor compounds in sesame seed oil,
J. Agric. Food Chem., 1996, 44, 12, 3909-3912, https://doi.org/10.1021/jf960115f
. [all data]
Shimoda, Wu, et al., 1996
Shimoda, M.; Wu, Y.; Osajima, Y.,
Aroma compounds from aqueous solution of Haze (Rhus succedanea) honey determined by adsorptive column chromatography,
J. Agric. Food Chem., 1996, 44, 12, 3913-3918, https://doi.org/10.1021/jf9601168
. [all data]
Shimoda, Shigematsu, et al., 1995
Shimoda, M.; Shigematsu, H.; Shiratsuchi, H.; Osajima, Y.,
Comparison of the odor concentrates by SDE and adsorptive column method from green tea infusion,
J. Agric. Food Chem., 1995, 43, 6, 1616-1620, https://doi.org/10.1021/jf00054a037
. [all data]
Shimoda, Shigematsu, et al., 1995, 2
Shimoda, M.; Shigematsu, H.; Shiratsuchi, H.; Osajima, Y.,
Comparison of volatile compounds among different grades of green tea and their relations to odor attributes,
J. Agric. Food Chem., 1995, 43, 6, 1621-1625, https://doi.org/10.1021/jf00054a038
. [all data]
Iwaoka, Hagi, et al., 1994
Iwaoka, W.; Hagi, Y.; Umano, K.; Shibamoto, T.,
Volatile chemicals identified in fresh and cooked breadfruit,
J. Agric. Food Chem., 1994, 42, 4, 975-976, https://doi.org/10.1021/jf00040a026
. [all data]
Chung, Eiserich, et al., 1993
Chung, T.Y.; Eiserich, J.P.; Shibamoto, T.,
Volatile compounds isolated from edible Korean chamchwi (Aster scaber Thunb),
J. Agric. Food Chem., 1993, 41, 10, 1693-1697, https://doi.org/10.1021/jf00034a033
. [all data]
Umano, Hagi, et al., 1992
Umano, K.; Hagi, Y.; Nakahara, K.; Shoji, A.; Shibamoto, T.,
Volatile constituents of green and ripened pineapple (Aanas comosus [L.] Merr.),
J. Agric. Food Chem., 1992, 40, 4, 599-603, https://doi.org/10.1021/jf00016a014
. [all data]
Humpf and Schreier, 1991
Humpf, H.-U.; Schreier, P.,
Bound aroma compounds from the fruit and the leaves of blackberry (Rubus laciniata L.),
J. Agric. Food Chem., 1991, 39, 10, 1830-1832, https://doi.org/10.1021/jf00010a028
. [all data]
Krammer, Winterhalter, et al., 1991
Krammer, G.; Winterhalter, P.; Schwab, M.; Schreier, P.,
Glycosidically bound aroma compounds in the fruits of Prunus species: Apricot (P. armeniaca, L.) peach (P. persica, L.) yellow plum (P. domestica, L. ssp. Syriaca),
J. Agric. Food Chem., 1991, 39, 4, 778-781, https://doi.org/10.1021/jf00004a032
. [all data]
Pabst, Barron, et al., 1991
Pabst, A.; Barron, D.; Etiévant, P.; Schreier, P.,
Studies on the enzymatic hydrolysis of bound aroma constituents from raspberry fruit pulp,
J. Agric. Food Chem., 1991, 39, 1, 173-175, https://doi.org/10.1021/jf00001a034
. [all data]
Suárez, Duque, et al., 1991
Suárez, M.; Duque, C.; Wintoch, H.; Schreier, P.,
Glycosidically bound aroma compounds from the pulp and the peelings of lulo fruit (Solanum vestissimum D.),
J. Agric. Food Chem., 1991, 39, 9, 1643-1645, https://doi.org/10.1021/jf00009a022
. [all data]
Frohlich and Schreier, 1990
Frohlich, O.; Schreier, P.,
Volatile Constituents of Loquat (Eriobotrya japonica Lindl.) Fruit,
J. Food Sci., 1990, 55, 1, 176-180, https://doi.org/10.1111/j.1365-2621.1990.tb06046.x
. [all data]
Fröhlich, Duque, et al., 1989
Fröhlich, O.; Duque, C.; Schreier, P.,
Volatile constituents of curuba (Passiflora mollissima) fruit,
J. Agric. Food Chem., 1989, 37, 2, 421-425, https://doi.org/10.1021/jf00086a033
. [all data]
Schwab, Mahr, et al., 1989
Schwab, W.; Mahr, C.; Schreier, P.,
Studies on the enzymic hydrolysis of bound aroma components from Carica papaya fruit,
J. Agric. Food Chem., 1989, 37, 4, 1009-1012, https://doi.org/10.1021/jf00088a042
. [all data]
Baltes and Mevissen, 1988
Baltes, W.; Mevissen, L.,
Model reactions on roast aroma formation. VI. Volatile reaction products from the reaction of phenylalanine with glucose during cooking and roasting,
Z. Lebensm. Unters. Forsch., 1988, 187, 3, 209-214, https://doi.org/10.1007/BF01043341
. [all data]
Chen, Kuo, et al., 1986
Chen, C.-C.; Kuo, M.-C.; Liu, S.-E.; Wu, C.-M.,
Volatile components of salted and pickled prunes (Prunus mume Sieb. et Zucc.),
J. Agric. Food Chem., 1986, 34, 1, 140-144, https://doi.org/10.1021/jf00067a038
. [all data]
Romeo, Ziino, et al., 2007
Romeo, V.; Ziino, M.; Giuffrrida, D.; Condurso, C.; Verzera, A.,
Flavour profile of capers (Capparis spinosa L.) from the Eolian Archipelago by HS-SPME/GC?MS,
Food Chem., 2007, 101, 3, 1272-1278, https://doi.org/10.1016/j.foodchem.2005.12.029
. [all data]
Frauendorfer and Schieberle, 2006
Frauendorfer, F.; Schieberle, P.,
Identification of the key aroma compounds in Cocoa powder based on molecular sensoly correlations,
J. Agr. Food Chem., 2006, 54, 15, 5521-5529, https://doi.org/10.1021/jf060728k
. [all data]
Guillot, Peytavi, et al., 2006
Guillot, S.; Peytavi, L.; Bureau, S.; Boulanger, R.; Lepoutre, J.-P.; Crouzet, J.; Schorr-Galindo, S.,
Aroma characterization of various apricot varieties using headspace-solid phase microextraction combined with gas chromatography-mass spectrometry and gas chromatography-olfactometry,
Food Chem., 2006, 96, 1, 147-155, https://doi.org/10.1016/j.foodchem.2005.04.016
. [all data]
Selli, Canbas, et al., 2006
Selli, S.; Canbas, A.; Cabaroglu, T.; Erten, H.; Gunata, Z.,
Aroma components of cv. Muscat of Bornova wines and influence of skin contact treatment,
Food Chem., 2006, 94, 3, 319-326, https://doi.org/10.1016/j.foodchem.2004.11.019
. [all data]
Selli, Canbas, et al., 2006, 2
Selli, S.; Canbas, A.; Cabaroglu, T.; Erten, H.; Lepoutre, J.-P.; Gunata, Z.,
Effect of skin contact on the free and bound aroma compounds of the white wine of Vitis vinifera L. cv Narince,
Food Control, 2006, 17, 1, 75-82, https://doi.org/10.1016/j.foodcont.2004.09.005
. [all data]
Aubert, Baumann, et al., 2005
Aubert, C.; Baumann, S.; Arguel, H.,
Optimization of the Analysis of Flavor Volatile Compounds by Liquid-Liquid Microextraction (LLME). Application to the Aroma Analysis of Melons, Peaches, Grapes, Strawberries, and Tomatoes,
J. Agric. Food Chem., 2005, 53, 23, 8881-8895, https://doi.org/10.1021/jf0510541
. [all data]
Wang, Finn, et al., 2005
Wang, Y.; Finn, C.; Qian, M.C.,
Impact of Growing Environment on Chickasaw Blackberry ( Rubus L.) Aroma Evaluated by Gas Chromatography Olfactometry Dilution Analysis,
J. Agric. Food Chem., 2005, 53, 9, 3563-3571, https://doi.org/10.1021/jf048102m
. [all data]
Ferrari, Lablanquie, et al., 2004
Ferrari, G.; Lablanquie, O.; Cantagrel, R.; Ledauphin, J.; Payot, T.; Fournier, N.; Guichard, E.,
Determination of key odorant compounds in freshly distilled cognac using GC-O, GC-MS, and sensory evaluation,
J. Agric. Food Chem., 2004, 52, 18, 5670-5676, https://doi.org/10.1021/jf049512d
. [all data]
Selli, Cabaroglu, et al., 2004
Selli, S.; Cabaroglu, T.; Canbas, A.; Erten, H.; Nurgel, C.; Lepoutre, J.P.; Gunata, Z.,
Volatile composition of red wine from cv. Kalecik Karasi grown in central Anatolia,
Food Chem., 2004, 85, 2, 207-213, https://doi.org/10.1016/j.foodchem.2003.06.008
. [all data]
Boido, Lloret, et al., 2003
Boido, E.; Lloret, A.; Medina, K.; Fariña, L.; Carrau, f.; Versini, G.; Dellacassa, E.,
Aroma composition of Vitis vinifera Cv. Tannat: the typical red wine from Uruguay,
J. Agric. Food Chem., 2003, 51, 18, 5408-5413, https://doi.org/10.1021/jf030087i
. [all data]
Huynh-Ba, Matthey-Doret, et al., 2003
Huynh-Ba, T.; Matthey-Doret, W.; Fay, L.B.; Rhlid, R.B.,
Generation of thiols by biotransformation of cysteine-aldehyde conjugates with Baker's yeast,
J. Agric. Food Chem., 2003, 51, 12, 3629-3635, https://doi.org/10.1021/jf026198j
. [all data]
da Porto, Pizzale, et al., 2003
da Porto, C.; Pizzale, L.; Bravin, M.; Conte, L.S.,
Analyses of orange spirit flavour by direct-injection gas chromatography-mass spectrometry and headspace solid-phase microextraction/GC-MC,
Flavour Fragr. J., 2003, 18, 1, 66-72, https://doi.org/10.1002/ffj.1164
. [all data]
Nurgel, Erten, et al., 2002
Nurgel, C.; Erten, H.; Canbas, A.; Cabaroglu, T.; Selli, S.,
Contribution by Saccharomyces cerevisiae yeasts to fermentation and flavour compounds in wines from cv. Kalecik karasi grape,
J. Inst. Brew., 2002, 108, 1, 68-72, https://doi.org/10.1002/j.2050-0416.2002.tb00126.x
. [all data]
Cantergiani, Brevard, et al., 2001
Cantergiani, E.; Brevard, H.; Krebs, Y.; Feria-Morales, A.; Amadò, R.; Yeretzian, C.,
Characterisation of the aroma of green Mexican coffee and identification of mouldy/earthy defect,
Eur. Food Res. Technol., 2001, 212, 6, 648-657, https://doi.org/10.1007/s002170100305
. [all data]
Ziegleder, 2001
Ziegleder, G.,
Odorous compounds in paperboard as influenced by recycled material and storage,
Packag. Technol. Sci., 2001, 14, 4, 131-136, https://doi.org/10.1002/pts.541
. [all data]
Bisio, Ciarallo, et al., 1998
Bisio, A.; Ciarallo, G.; Romussi, G.; Fontana, N.; Mascolo, N.; Capasso, R.; Biscardi, D.,
Chemical Composition of Essential Oils from some Salvia species,
Phytother. Res., 1998, 12, S1, s117-s120, https://doi.org/10.1002/(SICI)1099-1573(1998)12:1+3.0.CO;2-2
. [all data]
Prost, Serot, et al., 1998
Prost, C.; Serot, T.; Demaimay, M.,
Identification of the most potent odorants in wild and farmed cooked turbot (Scophtalamus maximus L.),
J. Agric. Food Chem., 1998, 46, 8, 3214-3219, https://doi.org/10.1021/jf980128o
. [all data]
Whitfield, Shea, et al., 1981
Whitfield, F.B.; Shea, S.R.; Gillen, K.J.; Shaw, K.J.,
Volatile components from the roots of Acacia pulchella R.Br. and their effect on Phytophthora cinnamomi rands,
Aust. J. Bot., 1981, 29, 2, 195-208, https://doi.org/10.1071/BT9810195
. [all data]
Nawrath, Mgode, et al., 2012
Nawrath, T.; Mgode, G.F.; Weetjens, B.; Kaufmann, S.H.E.; Schulz, S.,
The volatiles of pathogenic and nonpathogenic mycobacteria aand related bacteria,
Beilstein J. Org. Chem., 2012, 8, 290-297, https://doi.org/10.3762/bjoc.8.31
. [all data]
Ameen, Usman, et al., 2011
Ameen, O.M.; Usman, L.A.; Oganija, F.S.; Hamid, A.A.; Muhammed, N.O.; Zubair, M.F.; Adebayo, S.A.,
Chemical composition of leaf essential oil of Annona senegalensis Pers. (Annonaceae) growing in North Central Nigeria,
Int. J. Biol. Chem. Sci., 2011, 5, 1, 375-379. [all data]
Hammami, Kamoun, et al., 2011
Hammami, I.; Kamoun, N.; Rebai, A.,
Biocontrol of Botrytis cinerea with essential oil and methanol extract of Viola odorata flowers,
Archives of Appl. Sci. Res., 2011, 3, 5, 44-51. [all data]
Leffingwell and Alford, 2011
Leffingwell, J.; Alford, E.D.,
Volatile constituents of the giant pufball mushroom (Calvatia gigantea),
Leffingwell Rep., 2011, 4, 1-17. [all data]
Miyazawa, Marumoto, et al., 2011
Miyazawa, M.; Marumoto, S.; Kobayashi, T.; Yoshida, S.; Utsumi, Y.,
Determination of characteristic components in essential oils from Wisteria braphybotrys using gas chromatography - olfactometry incremental dilution technique,
Rec. Nat. Prod., 2011, 5, 3, 221-227. [all data]
Jardim, Jham, et al., 2010
Jardim, C.M.; Jham, G.N.; Dhingra, O.D.; Freire, M.M.,
Chemical composition and antifungal activity of the hexane extract of the Brazilian Chenopodium ambrosioides L.,
J. Braz. Chem. Soc., 2010, 21, 10, 1814-1818, https://doi.org/10.1590/S0103-50532010001000004
. [all data]
Jerkovic, Hegic, et al., 2010
Jerkovic, I.; Hegic, G.; Marijanovic, Z.; Bubalo, D.,
Organic extractives from Mentha spp. honey and the bee-stomach: methyl syringate, vomifoliol, terpenediol I, hotrienol, and other compounds,
Molecules, 2010, 15, 4, 2911-2924, https://doi.org/10.3390/molecules15042911
. [all data]
Jerkovic and Marijanovic, 2010
Jerkovic, I.; Marijanovic, Z.,
Oak (Quercus frainetto Ten.) honeydaw honey - approach to screening of volatile organic composition and antioxidant capacity (DPPH and FRAP assay),
Molecules, 2010, 15, 5, 3744-3756, https://doi.org/10.3390/molecules15053744
. [all data]
Jerkovic, Tuberso, et al., 2010
Jerkovic, I.; Tuberso, C.I.G.; Gugic, M.; Bubalo, D.,
Composition of Sulla (Hedysarum coronarium L.) honey solvent extractives determined by GC/MS: norisoprenoids and other volatile organic compounds,
Molecules, 2010, 15, 9, 6375-6385, https://doi.org/10.3390/molecules15096375
. [all data]
Pino, Marquez, et al., 2010
Pino, J.A.; Marquez, E.; Quijano, C.E.; Castro, D.,
Volatile compounds in noni (Morinda citrifolia L.) at two ripening stages,
Ciencia e Technologia de Alimentos, 2010, 30, 1, 183-187, https://doi.org/10.1590/S0101-20612010000100028
. [all data]
Radulovic, Blagojevic, et al., 2010
Radulovic, N.; Blagojevic, P.; Palic, R.,
Comparative study of the leaf volatiles of Arctostaphylos uva-ursi (L.) Spreng. and Vaccinium vitis-idaea L. (Ericaceae),
Molecules, 2010, 15, 9, 6168-6185, https://doi.org/10.3390/molecules15096168
. [all data]
Radulovic, Dordevic, et al., 2010
Radulovic, N.; Dordevic, N.; Markovic, M.; Palic, R.,
Volatile constituents of Glechoma Hirsuta Waldst. Kit. and G. Hederacea L. (Lamiaceae),
Bull. Chem. Soc. Ethiop., 2010, 24, 1, 67-76, https://doi.org/10.4314/bcse.v24i1.52962
. [all data]
Usman, Zubair, et al., 2010
Usman, L.A.; Zubair, M.F.; Adabayo, S.A.; Oladosu, I.A.; Muhammad, N.O.; Akolade, J.O.,
Chemical composition of leaf and fruit essential oils of Hoslundia opposita Vahl grown in Nigeria,
Americal-Eurasian J. Agric. Environ. Sci., 2010, 8, 1, 40-43. [all data]
Kim and Chung, 2009
Kim, J.-S.; Chung, H.Y.,
GC-MS analysis of the volatile components in dried boxthorn (Lycium chimensis) Fruit,
J. Korean Soc. Appl. Biol. Chem., 2009, 52, 5, 516-524, https://doi.org/10.3839/jksabc.2009.088
. [all data]
Radulovic, Blagojevic, et al., 2009
Radulovic, N.S.; Blagojevic, P.D.; Palic, R.M.; Zlatkovic, B.K.; Stevanovic, B.M.,
Volatiles from vegetative organs of the paleoendemic resurrection plants Ramonda serbica Panc. and Ramonda nathaliae Panc. at Petrov,
J. Serb. Chem. Soc., 2009, 74, 1, 35-44, https://doi.org/10.2298/JSC0901035R
. [all data]
Romeo, Verzera, et al., 2009
Romeo, V.; Verzera, A.; Ziino, M.; Condurao, C.; Tripodi, G.,
Headspace volatiles of Vicia sativa L. (Legumnodeae) by solid-phase microextraction and gas chromatography/mass spectrometry,
J. Ess. Oil Res., 2009, 21, 1, 33-35, https://doi.org/10.1080/10412905.2009.9700101
. [all data]
Bieri and Marriott, 2008
Bieri, S.; Marriott, P.J.,
Dual-injection system with multiply injections for determining sidimentional retention indexes in comprehensive two-dimensional gas chromatography,
Anal. Chem., 2008, 80, 3, 760-768, https://doi.org/10.1021/ac071367q
. [all data]
Frerot, Velluz, et al., 2008
Frerot, E.; Velluz, A.; Bagnoud, A.; Delort, E.,
Analysis of the volatile constituents of cooked petai beans (Parkia speciosa) using high-resolution GC/TOF-MS,
Flav. Fragr. J., 2008, 23, 6, 434-440, https://doi.org/10.1002/ffj.1902
. [all data]
Jardin, Jham, et al., 2008
Jardin, C.M.; Jham, G.N.; Dhingra, O.D.; Freire, M.M.,
Composition and Antifungal activity of the essential oil of the Brazilian Chenopodium ambrosioides L.,
J. Chem. Ecol., 2008, 34, 9, 1213-1218, https://doi.org/10.1007/s10886-008-9526-z
. [all data]
Mondello, Casilli, et al., 2008
Mondello, L.; Casilli, A.; Tranchida, Q.; Sciarrone, D.; Dugo, P.; Dugo, G.,
Analysis of allergens in fragrances using multiple heart-cut multidimentional gas chromatography - mass spectrometry,
LC-GC Europe, 2008, 21, 130. [all data]
Calyecac-cortero, Cibrian-Tovar, et al., 2007
Calyecac-cortero, H.G.; Cibrian-Tovar, J.; Soto-Hernandez, M.; Garcia-Velasco, R.,
Aislamento e identificacion de volatiles de Physalis philadelphica LAM. (Isolation and identification of Physalis philadelphica LAM. volatiles),
Agrociencia, 2007, 41, 337-346. [all data]
Edris, Chizzola, et al., 2007
Edris, A.E.; Chizzola, R.; Franz, C.,
Isolation and characterization of the volatile aroma compounds from the concrete headspace and the absolute of Jasminum sambac (L.) Ait. (Oleaceae) flowers grown in Egypt,
Eur. Food Res. Technol., 2007, https://doi.org/10.1007/s00217-007-0623-y
. [all data]
Füssel, Dötterl, et al., 2007
Füssel, U.; Dötterl, S.; Jürgens, A.; Aas, G.,
Inter- and intraspecific variation in floral scent in the genus Salix and its implication for pollination,
J. Chem. Ecol., 2007, 33, 4, 749-765, https://doi.org/10.1007/s10886-007-9257-6
. [all data]
Mohottalage, Tabacchi, et al., 2007
Mohottalage, S.; Tabacchi, R.; Guerin, P.M.,
Components from Sri Lankan Piper betle L. leaf oil and their analogues showing toxicity against the housefly, Musca domestica,
Flavour Fragr. J., 2007, 22, 2, 130-138, https://doi.org/10.1002/ffj.1770
. [all data]
Tava, Pecetti, et al., 2007
Tava, A.; Pecetti, L.; Ricci, M.; Pagnotta, M.A.; Russi, L.,
Volatile compounds from leaves and flowers of Bituminaria bituminosa (L.) Stirt. (Fabaceae) from Italy,
Flavour Fragr. J., 2007, 22, 5, 363-370, https://doi.org/10.1002/ffj.1806
. [all data]
Xu, Fan, et al., 2007
Xu, Y.; Fan, W.; Qian, M.C.,
Characterization of Aroma Compounds in Apple Cider Using Solvent-Assisted Flavor Evaporation and Headspace Solid-Phase Microextraction,
J. Agric. Food Chem., 2007, 55, 8, 3051-3057, https://doi.org/10.1021/jf0631732
. [all data]
Castel, Fernandez, et al., 2006
Castel, C.; Fernandez, X.; Lizzani-Cuvelier, L.; Loiseau, A.-M.; Perichet, C.; Delbecque, C.; Arnaudo, J.-F.,
Volatile constituents of benzoin gums: Siam and Sumatra, part 2. Study of headspace sampling methods,
Flavour Fragr. J., 2006, 21, 1, 59-67, https://doi.org/10.1002/ffj.1502
. [all data]
Castel, Fernandez, et al., 2006, 2
Castel, C.; Fernandez, X.; Lizzani-Cuvelier, L.; Perichet, C.; Lavoine, S.,
Characterization of the Chemical Composition of a Byproduct from Siam Benzoin Gum,
J. Agric. Food Chem., 2006, 54, 23, 8848-8854, https://doi.org/10.1021/jf061193y
. [all data]
Fadel, Mageed, et al., 2006
Fadel, H.H.M.; Mageed, M.A.A.; Samad, A.K.M.E.A.; Lotfy, S.N.,
Cocoa substitute: Evaluation of sensory qualities and flavour stability,
Eur. Food Res. Technol., 2006, 223, 1, 125-131, https://doi.org/10.1007/s00217-005-0162-3
. [all data]
Pino, Marbot, et al., 2006
Pino, J.A.; Marbot, R.; Payo, A.; Chao, D.; Herrera, P.,
Aromatic Plants from Western Cuba VII. Composition of the Leaf Oil of Psidium wrightii KRug et Urb., Lantana involucrata L., Cinnamonum montanum (Sw.) Berchtold et J. Persl. and Caesalpinia violacea (Mill.) Standley,
J. Essent. Oil. Res., 2006, 18, 2, 170-174, https://doi.org/10.1080/10412905.2006.9699058
. [all data]
Schlumpberger B.O., Clery R.A., et al., 2006
Schlumpberger B.O.; Clery R.A.; Barthlott W.,
A unique cactus with scented and possibly bat-dispersed fruits: Rhipsalis juengeri,
Plant Biology, 2006, 8, 2, 265-270, https://doi.org/10.1055/s-2005-873045
. [all data]
Schmidt, Jirovetz, et al., 2006
Schmidt, E.; Jirovetz, L.; Buchbauer, G.; Eller, G.A.; Stoilova, I.; Krastanov, A.; Stoyanova, A.; Geisseler, M.,
Composition and antioxidant activities of the essential oil of cinnamon (Cinnamomum zeylanicum Blume) leaves from Sri Lanka,
Jeobp, 2006, 9, 2, 170-182. [all data]
Setzer, Noletto, et al., 2006
Setzer, W.N.; Noletto, J.A.; Lawton, R.O.,
Chemical composition of the floral essential oil of Randia matudae from Monteverde, Costa Rica,
Flavour Fragr. J., 2006, 21, 2, 244-246, https://doi.org/10.1002/ffj.1567
. [all data]
Boustie, Rapior, et al., 2005
Boustie, J.; Rapior, S.; Fortin, H.; Tomas, S.; Bessiere, J.-M.,
Chemotaxonomic interest of volatile components in Lepista inversa and Lepista flaccida distinctions,
Cryptogamie, Mycologie, 2005, 26, 1, 1-4. [all data]
Dickschat, Bode, et al., 2005
Dickschat, J.S.; Bode, H.B.; Wenzel, S.C.; Muller, R.; Schulz, S.,
Biosinthesis and Identification of Volatiles Released by the Myxobacterium Stigmatella aurantiaca,
ChemBioChem, 2005, 6, 11, 2023-2033, https://doi.org/10.1002/cbic.200500174
. [all data]
Dickschat, Martens, et al., 2005
Dickschat, J.S.; Martens, T.; Brinkhoff, T.; Simon, M.; Schulz, S.,
Volatiles released by a Streptomyces species isolated from the North Sea,
Chemistry and Biodiversity, 2005, 2, 7, 837-865, https://doi.org/10.1002/cbdv.200590062
. [all data]
Dötterl and Jürgens, 2005
Dötterl, S.; Jürgens, A.,
Spatial fragrance patterns in flowers of Silene latifolia: Lilac compounds as olfactory nectar guides?,
Plant Systematics and Evolution, 2005, 255, 1-2, 99-109, https://doi.org/10.1007/s00606-005-0344-2
. [all data]
Dötterl, Wolfe, et al., 2005
Dötterl, S.; Wolfe, L.M.; Jürgens, A.,
Qualitative and quantitative analyses of flower scent in Silene latifolia,
Phytochemistry, 2005, 66, 2, 203-213, https://doi.org/10.1016/j.phytochem.2004.12.002
. [all data]
El-Sayed, Heppelthwaite, et al., 2005
El-Sayed, A.M.; Heppelthwaite, V.J.; Manning, L.M.; Gibb, A.R.; Suckling, D.M.,
Volatile constituents of fermented sugar baits and their attraction to lepidopteran species,
J. Agric. Food Chem., 2005, 53, 4, 953-958, https://doi.org/10.1021/jf048521j
. [all data]
Jelén, Krawczyk, et al., 2005
Jelén, H.H.; Krawczyk, J.; Larsen, T.O.; Jarosz, A.; Golebniak, B.,
Main compounds responsible for off-odour of strawberries infected by Phytophthora cactorum,
Lett. Appl. Microbiol., 2005, 40, 4, 255-259, https://doi.org/10.1111/j.1472-765X.2005.01668.x
. [all data]
Jirovetz, Buchbauer, et al., 2005
Jirovetz, L.; Buchbauer, G.; Stoyanova, A.; Georgiev, E.V.; Damianova, S.T.,
Composition, quality control and antimicrobial activity of the essential oil of cumin (Cuminum cyminumL.) seeds from Bulgaria that had been stored for up to 36 years,
Int. J. Food Sci. Technol., 2005, 40, 3, 305-310, https://doi.org/10.1111/j.1365-2621.2004.00915.x
. [all data]
Kilic, Kollmannsberger, et al., 2005
Kilic, A.; Kollmannsberger, H.; Nitz, S.,
Glycosidically bound volatiles and flavor precursors in Laurus nobilis L.,
J. Agric. Food Chem., 2005, 53, 6, 2231-2235, https://doi.org/10.1021/jf040373+
. [all data]
Leffingwell and Alford, 2005
Leffingwell, J.C.; Alford, E.D.,
Volatile constituents of Perique tobacco,
Electron. J. Environ. Agric. Food Chem., 2005, 4, 2, 899-915. [all data]
van Loon, Linssen, et al., 2005
van Loon, W.A.M.; Linssen, J.P.H.; Legger, A.; Posthumus, M.A.; Voragen, A.G.J.,
Identification and olfactometry of French fries flavour extracted at mouth conditions,
Food Chem., 2005, 90, 3, 417-425, https://doi.org/10.1016/j.foodchem.2004.05.005
. [all data]
Nyegue, Belinga-Ndoye, et al., 2005
Nyegue, M.A.; Belinga-Ndoye, C.F.; Amvam Zollo, P.H.; Agnaniet, H.; Menut, C.; Bessière, J.M.,
Aromatic plants of tropical central Africa. Part L. Volatile components of Clerodendrum buchholzii Gürke from Cameroon,
Flavour Fragr. J., 2005, 20, 3, 321-323, https://doi.org/10.1002/ffj.1424
. [all data]
Pino, Marbot, et al., 2005
Pino, J.A.; Marbot, R.; Rosado, A.; Vázquez, C.,
Volatile constituents of genipap (Genipa americana L.) fruit from Cuba,
Flavour Fragr. J., 2005, 20, 6, 583-586, https://doi.org/10.1002/ffj.1491
. [all data]
Shams-Ardakani, Ghannadi, et al., 2005
Shams-Ardakani, M.; Ghannadi, A.; Badr, P.; Mohagheghzadeh, A.,
Biotransformation of terpenes and related compounds by suspension culture of Glycyrrhiza glabra L. (Papilionaceae),
Flavour Fragr. J., 2005, 20, 2, 141-144, https://doi.org/10.1002/ffj.1401
. [all data]
Tesevic, Nikicevic, et al., 2005
Tesevic, V.; Nikicevic, N.; Jovanovic, A.; Djokovic, D.; Vujisic, L.; Vuckovic, I.; Bonic, M.,
Volatile components from old plum brandies,
Food Technol. Biotechnol., 2005, 43, 4, 367-372. [all data]
Jürgens and Dötterl, 2004
Jürgens, A.; Dötterl, S.,
Chemical composition of anther volatiles in Ranunculaceae: genera-specific profiles in Aemone, Aquilegia, Caltha, Pulsatilla, Ranunculus, and Trollius species,
American Journal of Botany, 2004, 91, 12, 1969-1980, https://doi.org/10.3732/ajb.91.12.1969
. [all data]
Park, Lee, et al., 2004
Park, B.-S.; Lee, K.-G.; Takeoka, G.R.,
Comparison of three sample preparation methods on the recovery of volatiles from taheebo (Tabebuia impetiginosa Martius ex DC),
Flavour Fragr. J., 2004, 19, 4, 287-292, https://doi.org/10.1002/ffj.1345
. [all data]
Simic, Sokovic, et al., 2004
Simic, A.; Sokovic, M.D.; Ristic, M.; Grujic-Jovanovic, S.; Vukojevic, J.; Marin, P.D.,
The chemical composition of some Lauraceae essential oils and their antifungal activities,
Phytother. Res., 2004, 18, 9, 713-717, https://doi.org/10.1002/ptr.1516
. [all data]
Woerdenbag, Windono, et al., 2004
Woerdenbag, H.J.; Windono, T.; Bos, R.; Riswan, S.; Quax, W.J.,
Composition of the essential oils of Kaempferia rotunda L. and Kaempferia angustifolia Roscoe rhizomes from Indonesia,
Flavour Fragr. J., 2004, 19, 2, 145-148, https://doi.org/10.1002/ffj.1284
. [all data]
Agnaniet, Mounzeo, et al., 2003
Agnaniet, H.; Mounzeo, H.; Menut, C.; Bessiere, J.-M.; Criton, M.,
The essential oils of Rinorea subintegrifolia O. Ktze and Drypetes gossweileri S. Moore occurring in Gabon,
Flavour Fragr. J., 2003, 18, 3, 207-210, https://doi.org/10.1002/ffj.1185
. [all data]
Ghannadi and Zolfaghari, 2003
Ghannadi, A.; Zolfaghari, B.,
Compositional analysis of the essential oil of Lallemantia royleana (Benth. in Wall.) Benth. from Iran,
Flavour Fragr. J., 2003, 18, 3, 237-239, https://doi.org/10.1002/ffj.1215
. [all data]
Jirovetz, Buchbauer, et al., 2003
Jirovetz, L.; Buchbauer, G.; Stoyanova, A.S.; Georgiev, E.V.; Damianova, S.T.,
Composition, quality control, and antimicrobial activity of the essential oil of long-time stored dill (Anethum graveolens L.) seeds from Bulgaria,
J. Agric. Food Chem., 2003, 51, 13, 3854-3857, https://doi.org/10.1021/jf030004y
. [all data]
Jirovetz, Buchbauer, et al., 2003, 2
Jirovetz, L.; Buchbauer, G.; Shafi, M.P.; Leela, N.K.,
Analysis of the essential oils of the leaves, stems, rhizomes and roots of the medicinal plant Alpinia galanga from southern India,
Acta Pharm. Hung., 2003, 53, 73-81. [all data]
Ledauphin, Guichard, et al., 2003
Ledauphin, J.; Guichard, H.; Saint-Clair, J.-F.; Picoche, B.; Barillier, D.,
Chemical and sensorial aroma characterization of freshly distilled calvados. 2. Identification of volatile compounds and key odorants,
J. Agric. Food Chem., 2003, 51, 2, 433-442, https://doi.org/10.1021/jf020373e
. [all data]
Pino, Marbot, et al., 2003
Pino, J.A.; Marbot, R.; Fuentes, V.,
Characterization of volatiles in Bullock's heart (Annona reticulata L.) fruit cultivars from Cuba,
J. Agric. Food Chem., 2003, 51, 13, 3836-3839, https://doi.org/10.1021/jf020733y
. [all data]
Sebastian, Viallon-Fernandez, et al., 2003
Sebastian, I.; Viallon-Fernandez, C.; Berge, P.; Berdague, J.-L.,
Analysis of the volatile fraction of lamb fat tissue: influence of the type of feeding,
Sciences des Aliments, 2003, 23, 4, 497-511, https://doi.org/10.3166/sda.23.497-511
. [all data]
Vichi, Pizzale, et al., 2003
Vichi, S.; Pizzale, L.; Conte, L.S.; Buxaderas, S.; López-Tamames, E.,
Solid-phase microextraction in the analysis of virgin olive oil volatile fraction: characterization of virgin olive oils from two distinct geographical areas of Northern Italy,
J. Agric. Food Chem., 2003, 51, 22, 6572-6577, https://doi.org/10.1021/jf030269c
. [all data]
Isidorov and Jdanova, 2002
Isidorov, V.; Jdanova, M.,
Volatile organic compounds from leaves litter,
Chemosphere, 2002, 48, 9, 975-979, https://doi.org/10.1016/S0045-6535(02)00074-7
. [all data]
Jirovetz, Smith, et al., 2002
Jirovetz, L.; Smith, D.; Buchbauer, G.,
Aroma compound analysis of Eruca sativa (Brassicaceae) SPME headspace leaf samples using GC, GC-MS, and olfactometry,
J. Agric. Food Chem., 2002, 50, 16, 4643-4646, https://doi.org/10.1021/jf020129n
. [all data]
Kobaisy, Tellez, et al., 2002
Kobaisy, M.; Tellez, M.R.; Dayan, F.E.; Duke, S.O.,
Phytotoxicity and volatile constituents from leaves of Callicarpa japonica Thunb.,
Phytochemistry, 2002, 61, 1, 37-40, https://doi.org/10.1016/S0031-9422(02)00207-8
. [all data]
Pino, Marbot, et al., 2002, 2
Pino, J.A.; Marbot, R.; Vazquez, C.,
Characterization of volatiles in Loquat fruit (Eriobotrya japonica Lindl.),
Revista CENIC Ciencias Quimicas, 2002, 33, 3, 115-119. [all data]
Tellez, Khan, et al., 2002
Tellez, M.R.; Khan, I.A.; Kobaisy, M.; Schrader, K.K.; Dayan, F.E.; Osbrink, W.,
Composition of the essential oil of Lepidium meyenii (Walp.),
Phytochemistry, 2002, 61, 2, 149-155, https://doi.org/10.1016/S0031-9422(02)00208-X
. [all data]
Zenkevich and Rodin, 2002
Zenkevich, I.G.; Rodin, A.A.,
Gas Chromatographic One-Step Determination of Number of Hydroxyl Groups in Polyphenols with Mixed Derivatization Reagents,
Zh. Anal. Khim. (Rus.), 2002, 57, 7, 732-736. [all data]
Zoghbi, Andrade, et al., 2002
Zoghbi, M.G.B.; Andrade, E.H.A.; Maia, J.G.S.,
Volatile constituents from Adenocalymma alliaceum Miers and Petiveria alliacea L., two medicinal herbs of the Amazon,
Flavour Fragr. J., 2002, 17, 2, 133-135, https://doi.org/10.1002/ffj.1051
. [all data]
Yang, 2001
Yang, R.,
Analysis of the volatile components in peel oil of Yuzu by gas chromatography/mass spectrometry,
Chin. J. Anal. Chem., 2001, 29, 3, 313-316. [all data]
García, Martín, et al., 2000
García, C.; Martín, A.; Timón, M.L.; Córdoba, J.J.,
Microbial populations and volatile compounds in the 'bone taint' spoilage of dry cured ham,
Lett. Appl. Microbiol., 2000, 30, 1, 61-66, https://doi.org/10.1046/j.1472-765x.2000.00663.x
. [all data]
Tellez, Dayan, et al., 2000
Tellez, M.R.; Dayan, F.E.; Schrader, K.K.; Wedge, D.E.; Duke, S.O.,
Composition and some biological activities of the essential oils of Callicarpa Americana (L.),
J. Agric. Food Chem., 2000, 48, 7, 3008-3012, https://doi.org/10.1021/jf991026g
. [all data]
Baraldi, Rapparini, et al., 1999
Baraldi, R.; Rapparini, F.; Rossi, F.; Latella, A.; Ciccioli, P.,
Volatile organic compound emissions from flowers of the most occurring and economically important species of fruit trees,
Phys. Chem. Earth, 1999, 24, 6, 729-732, https://doi.org/10.1016/S1464-1909(99)00073-8
. [all data]
Menon, Chacko, et al., 1999
Menon, A.N.; Chacko, S.; Narayanan, C.S.,
Free and glycosidically bound volatiles of cardamom (Eletteria cardamomum Maton var. miniscula Burkill),
Flavour Fragr. J., 1999, 14, 1, 65-68, https://doi.org/10.1002/(SICI)1099-1026(199901/02)14:1<65::AID-FFJ789>3.0.CO;2-A
. [all data]
Schultz, Kaiser, et al., 1999
Schultz, K.; Kaiser, R.; Knudsen, J.T.,
Cyclanthone and derivatives, new natural products in the flower scent of Cyclanthus bipartitus Poit.,
Flavour Fragr. J., 1999, 14, 3, 185-190, https://doi.org/10.1002/(SICI)1099-1026(199905/06)14:3<185::AID-FFJ809>3.0.CO;2-7
. [all data]
Tellez, Canel, et al., 1999
Tellez, M.R.; Canel, C.; Rimando, A.M.; Duke, S.O.,
Differential accumulation of isoprenoids in glanded and glandless Artemisia annua L,
Phytochemistry, 1999, 52, 6, 1035-1040, https://doi.org/10.1016/S0031-9422(99)00308-8
. [all data]
Boylston and Viniyard, 1998
Boylston, T.D.; Viniyard, B.T.,
Isolation of volatile flavor compounds from peanut butter using purge-and-trap technique
in Instrumental Methods in Food and Beverage Analysis, D. Wetzel and G. Charalambous, ed(s)., 1998, 225-243. [all data]
Fons, Rapior, et al., 1998
Fons, F.; Rapior, S.; Gargadennec, A.; Andary, C.; Bessiere, J.-M.,
Volatile components of Plantago lanceolata (Plantaginaceae),
Acta bot. Gallica, 1998, 145, 4, 265-269, https://doi.org/10.1080/12538078.1998.10516306
. [all data]
Lamarque, Maestri, et al., 1998
Lamarque, A.L.; Maestri, D.M.; Zygadlo, J.A.; Grosso, N.R.,
Volatile constituents from flowers of Acacia caven (Mol.) Mol. var. caven, Acacia aroma Gill. ex Hook., Erythrina crista-galli L. and Calliandra tweedii Benth.,
Flavour Fragr. J., 1998, 13, 4, 266-268, https://doi.org/10.1002/(SICI)1099-1026(1998070)13:4<266::AID-FFJ739>3.0.CO;2-5
. [all data]
Ong, Acree, et al., 1998
Ong, P.K.C.; Acree, T.E.; Lavin, E.H.,
Characterization of volatiles in rambutan fruit (Nephelium lappaceum L.),
J. Agric. Food Chem., 1998, 46, 2, 611-615, https://doi.org/10.1021/jf970665t
. [all data]
D'Arcy, Rintoul, et al., 1997
D'Arcy, B.R.; Rintoul, G.B.; Rowland, C.Y.; Blackman, A.J.,
Composition of Australian honey extractives. 1. Norisoprenoids, monoterpenes, and other natural volatiles from blue gum (Eucalyptus leucoxylon) and yellow box (Eucalyptus melliodora) honeys,
J. Agric. Food Chem., 1997, 45, 5, 1834-1843, https://doi.org/10.1021/jf960625+
. [all data]
Sagrero-Nieves and Bartley, 1996
Sagrero-Nieves, L.; Bartley, J.P.,
Volatile components from the leaves of heterotheca inuloides Cass.,
Flavour Fragr. J., 1996, 11, 1, 49-51, https://doi.org/10.1002/(SICI)1099-1026(199601)11:1<49::AID-FFJ538>3.0.CO;2-J
. [all data]
Wong and Lai, 1996
Wong, K.C.; Lai, F.Y.,
Volatile constituents from the fruits of four Syzygium species grown in Malaysia,
Flavour Fragr. J., 1996, 11, 1, 61-66, https://doi.org/10.1002/(SICI)1099-1026(199601)11:1<61::AID-FFJ539>3.0.CO;2-1
. [all data]
Stashenko, Torres, et al., 1995
Stashenko, E.E.; Torres, W.; Morales, J.R.M.,
A study of the compositional variation of the essential oil of ylang-ylang (Cananga odorata Hook Fil. et Thomson, forma genuina) during flower development,
J. Hi. Res. Chromatogr., 1995, 18, 2, 101-104, https://doi.org/10.1002/jhrc.1240180206
. [all data]
Tamura, Nakamoto, et al., 1995
Tamura, H.; Nakamoto, H.; Yang, R.-H.; Sugisawa, H.,
Characteristic aroma compounds in green algae (Ulva pertusa) volatiles,
Nippon Shokuhin Kagaku Kogaku Kaishi, 1995, 42, 11, 887-891, https://doi.org/10.3136/nskkk.42.887
. [all data]
Buttery, Stern, et al., 1994
Buttery, R.G.; Stern, D.J.; Ling, L.C.,
Studies on flavor volatiles of some sweet corn products,
J. Agric. Food Chem., 1994, 42, 3, 791-795, https://doi.org/10.1021/jf00039a038
. [all data]
Tamura, Yang, et al., 1993
Tamura, H.; Yang, R.-H.; Sugisawa, H.,
Aroma profiles of peel oils of acid citrus,
ACS Sym. Ser., 1993, 525, 121-136. [all data]
Binder, Turner, et al., 1990
Binder, R.G.; Turner, C.E.; Flath, R.A.,
Volatile components of purple starthistle,
J. Agric. Food Chem., 1990, 38, 4, 1053-1055, https://doi.org/10.1021/jf00094a030
. [all data]
Jantan and Goh, 1990
Jantan, I.; Goh, S.H.,
The essential oils of Cinnamomum mollissimum as natural sources of safrole and benzyl benzoate,
J. Tropical Forest Sci., 1990, 2, 3, 252-259. [all data]
Spadone, Takeoka, et al., 1990
Spadone, J.-C.; Takeoka, G.; Liardon, R.,
Analytical Investigation of Rio Off-Flavor in Green Coffee,
J. Agric. Food Chem., 1990, 38, 1, 226-233, https://doi.org/10.1021/jf00091a050
. [all data]
Binder, Flath, et al., 1989
Binder, R.G.; Flath, R.A.; Mon, T.R.,
Volatile components of bittermelon,
J. Agric. Food Chem., 1989, 37, 2, 418-420, https://doi.org/10.1021/jf00086a032
. [all data]
Binder and Flath, 1989
Binder, R.G.; Flath, R.A.,
Volatile components of pineapple guava,
J. Agric. Food Chem., 1989, 37, 3, 734-736, https://doi.org/10.1021/jf00087a034
. [all data]
Schwab and Schreier, 1988
Schwab, W.; Schreier, P.,
Simultaneous enzyme catalysis extraction: A versatile technique for the study of flavor precursors,
J. Agric. Food Chem., 1988, 36, 6, 1238-1242, https://doi.org/10.1021/jf00084a028
. [all data]
Wu, Zhao, et al., 1987
Wu, C.; Zhao, D.; Sun, S.; Ma, Y.; Wang, Q.; Lu, S.,
The minor chemical components of the absolute oil from the flower,
Acta botanica Sinica, 1987, 29, 6, 636-642. [all data]
Flath, Mon, et al., 1983
Flath, R.A.; Mon, T.R.; Lorenz, G.; Whitten, C.J.; Mackley, J.W.,
Volatile components of Acacia sp. blossoms,
J. Agric. Food Chem., 1983, 31, 6, 1167-1170, https://doi.org/10.1021/jf00120a008
. [all data]
Dahlmann, Köser, et al., 1979
Dahlmann, G.; Köser, H.J.K.; Oelert, H.H.,
Multiple korrelation von retentionsindizes,
Chromatographia, 1979, 12, 10, 665-671, https://doi.org/10.1007/BF02302943
. [all data]
Schreyen, Dirinck, et al., 1979
Schreyen, L.; Dirinck, P.; Sandra, P.; Schamp, N.,
Flavor analysis of quince,
J. Agric. Food Chem., 1979, 27, 4, 872-876, https://doi.org/10.1021/jf60224a058
. [all data]
Mondello, 2012
Mondello, L.,
HS-SPME-GCxGC-MS analysis of Yerba Mate (Ilex paraguariensis)
in Shimadzu GC-GC application compendium of comprehensive 2D GC, Vol. 1-5, Shimadzu Corp., 2012, 1-29. [all data]
Robinson, Adams, et al., 2012
Robinson, A.L.; Adams, D.O.; Boss, P.K.; Heymann, H.; Solomon, P.S.; Trengove, R.D.,
Influence of geographic origine on the sensory characteristics and wine composition of Vitus viniferas cv. Cabernet Sauvignon wines from Australia (Supplemental data),
Am. J. Enol. Vitic., 2012, 64, 4, 467-476, https://doi.org/10.5344/ajev.2012.12023
. [all data]
VOC BinBase, 2012
VOC BinBase,
The volatile compound BinBase (VOC BinBase), 2012, retrieved from http://fiehnlab.ucdavis.edu/projects/VocBinBase and http://binbase.sourceforge.net. [all data]
Skogerson, Wohlgemuth, et al., 2011
Skogerson, K.; Wohlgemuth, G.; Fiehn, O.,
VocBinNase, 2011, retrieved from http://fiehnlab.ucdavis.edu/projects//VocBinBase. [all data]
Di Giusto, Bessiere, et al., 2010
Di Giusto, B.; Bessiere, J.-M.; Gueroult, M.; Lim, L.B.L.; Marshall, D.J.; Hossaert-McKey, M.; Gaume, L.,
Flower-scent mimicry masks a deadly trap in the carnivorous plant Nepenthes raffesiana,
J. Ecology, 2010, 98, 4, 845-856, https://doi.org/10.1111/j.1365-2745.2010.01665.x
. [all data]
Al-Reza, Rahman, et al., 2009
Al-Reza, S.M.; Rahman, A.; Kang, S.C.,
Chemical composition and inhibitory effect of essentiasl oil and organic extracts of Cestrum nocturnum L. om food-borne pathogens,
Int. J. Food Sci. Technol., 2009, 44, 6, 1176-1182, https://doi.org/10.1111/j.1365-2621.2009.01939.x
. [all data]
Bajpai, Al-Reza, et al., 2009
Bajpai, V.K.; Al-Reza, S.M.; Choi, U.L.; Lee, J.H.; Kang, S.C.,
Chemical composition, antibacterial and antioxidant activities of leaf essential oil and extracts of Metasequioa glyptostroboides Miki ex Hu,
Food Chem. Toxicol., 2009, 47, 8, 1876-1883, https://doi.org/10.1016/j.fct.2009.04.043
. [all data]
Fan, Lu, et al., 2009
Fan, G.; Lu, W.; Yao, X.; Zhang, Y.; Wang, K.; Pan, S.,
effect of fermentation on free and bound volatile compounds of orange juice,
Flavour Fragr. J., 2009, 24, 5, 219-229, https://doi.org/10.1002/ffj.1931
. [all data]
Mebazaa, Mahmoudi, et al., 2009
Mebazaa, R.; Mahmoudi, A.; Fouchet, M.; Dos Santos, M.; Kamissoko, F.; Nafti, A.; Ben Cheikh, R.; Rega, B.; Camel, V.,
Characterization of volatile compounds in Tunisian fenugreek seeds,
Food Chem., 2009, 115, 4, 1326-1336, https://doi.org/10.1016/j.foodchem.2009.01.066
. [all data]
de Simon, Estruelas, et al., 2009
de Simon, B.F.; Estruelas, E.; Munoz, A.M.; Cadahia, E.; Sanz, M.,
Volatile compounds in acacia, chestnut, cherry, ash, and oak woods, with a view to their use in cooperage,
J. Agric. Food Chem., 2009, 57, 8, 3217-3227, https://doi.org/10.1021/jf803463h
. [all data]
Collin, Nizet, et al., 2008
Collin, S.; Nizet, S.; Muls, S.; Iraqi, R.; Bouseta, A.,
Characterization of odor-active compounds in extracts obtained by simultaneous extraction/distillation from Moroccan black olives,
J. Agric. Food Chem., 2008, 56, 9, 3273-3278, https://doi.org/10.1021/jf073488x
. [all data]
Kannaste, Vongvanich, et al., 2008
Kannaste, A.; Vongvanich, N.; Borg-Karlson, A.-K.,
Infestation by a Nalepella species induces emissions of alpha- and beta-farnesenes, (-)-linalool and aromatic compounds in Norway spruce clones of different susceptibility to the large pine weevil,
Anthropod-Plant Interactions, 2008, 2, 1, 31-41, https://doi.org/10.1007/s11829-008-9029-4
. [all data]
Kristiawan, Sobolik, et al., 2008
Kristiawan, M.; Sobolik, V.; Al-Haddad, M.; Allaf, K.,
Effect of pressure-drop rate on the isolation of cananga oil using instantaneous controlled pressure-drop process,
Chem. Eng. Processing, 2008, 47, 1, 66-75, https://doi.org/10.1016/j.cep.2007.08.011
. [all data]
Profitt, Schatz, et al., 2008
Profitt, M.; Schatz, B.; Bessiere, J.-M.; Chen, C.; Soler, C.; Hossaert-McKey, M.,
Signalling receptivity: comparison of the emission of volatile compounds by figs of Ficus hispida before, during and after the phase of receptivity to pollinators,
Symbiosis, 2008, 45, 1-10. [all data]
Zhao, Li, et al., 2008
Zhao, Y.; Li, J.; Xu, Y.; Duan, H.; Fan, W.; Zhao, G.,
EXtraction, preparation and identification of volatile compounds in Changyu XO brandy,
Chinese J. Chromatogr., 2008, 26, 2, 212-222, https://doi.org/10.1016/S1872-2059(08)60014-0
. [all data]
Zhu, Li, et al., 2008
Zhu, M.; Li, E.; He, H.,
Determination of volatile chemical constitutes in tea by simultaneous distillation extraction, vacuum hydrodistillation and thermal desrption,
Chromatographia, 2008, 68, 7/8, 603-610, https://doi.org/10.1365/s10337-008-0732-1
. [all data]
Beaulieu and Lancaster, 2007
Beaulieu, J.C.; Lancaster, V.A.,
Correlating Volatile Compounds, Sensory Attributes, and Quality Parameters in Stored Fresh-Cut Cantaloupe,
J. Agric. Food Chem., 2007, 55, 23, 9503-9513, https://doi.org/10.1021/jf070282n
. [all data]
Bosch-Fuste, Riu-Aumatell, et al., 2007
Bosch-Fuste, J.; Riu-Aumatell, M.; Guadayol, J.M.; Caixach, J.; Lopez-Tamames, E.; Buxaderas, S.,
Volatile profiles of sparkling wines obtained by three extraction methods and gas chromatography-mass spectrometry (GC-MS) analysis,
Food Chem., 2007, 105, 1, 428-435, https://doi.org/10.1016/j.foodchem.2006.12.053
. [all data]
Cajka, Hajslova, et al., 2007
Cajka, T.; Hajslova, J.; Cochran, J.; Holadova, K.; Klimankova, E.,
Solid phase microextraction - comprehensive two dimensional gas chromatography - time-of-flight mass spectrometry for the analysis of honey volatiles,
J. Sep. Sci., 2007, 30, 4, 534-546, https://doi.org/10.1002/jssc.200600413
. [all data]
Dou, Li, et al., 2007
Dou, H.-L.; Li, C.-M.; Gu, H.-F.; Hao, J.-F.,
Comparative analysis on aromatic components of green tea and fresh green tea beverage using HS-SPME/GC-MS/GC-olfactometry/RI methods,
Journal of Tea Science, 2007, 27, 1, 51-60. [all data]
Meekijjaroenroj, Bessière, et al., 2007
Meekijjaroenroj, A.; Bessière, J.-M.; Anstett, M.-C.,
Chemistry of floral scents in four Licuala species (Arecaceae),
Flavour Fragr. J., 2007, 22, 4, 300-310, https://doi.org/10.1002/ffj.1797
. [all data]
Proffit, 2007
Proffit, M.,
Mediation chimique et structuration des communautes d'hymenopteres parasites du mutualisme figuier / pollinisateur (These pour obtenir le grade de Docteur de l'Universite Montpellier II) (Dissertation), 2007. [all data]
Splivallo, Bossi, et al., 2007
Splivallo, R.; Bossi, S.; Maffei, M.; Bonfante, P.,
Discrimination of truffle fruiting body versus mycelial aromas by stir bar sorptive extraction,
Phytochemistry, 2007, 68, 20, 2584-2598, https://doi.org/10.1016/j.phytochem.2007.03.030
. [all data]
Beaulieu J.C. and Lea J.M., 2006
Beaulieu J.C.; Lea J.M.,
Characterization and semiquantitative analysis of volatiles in seedless watermelon varieties using solid-phase microextraction,
J. Agric. Food Chem., 2006, 54, 20, 7789-7793, https://doi.org/10.1021/jf060663l
. [all data]
Alissandrakis, Kibaris, et al., 2005
Alissandrakis, E.; Kibaris, A.C.; Tarantilis, P.A.; Harizanis, P.C.; Polissiou, M.,
Flavour compounds of Greek cotton honey,
J. Sci. Food Agric., 2005, 85, 9, 1444-1452, https://doi.org/10.1002/jsfa.2124
. [all data]
Iraqi, Vermeulen, et al., 2005
Iraqi, R.; Vermeulen, C.; Benzekri, A.; Bouseta, A.; Collin, S.,
Screening for key odorants in Moroccan green olives by gas chromatography-olfactometry/aroma extract dilution analysis,
J. Agric. Food Chem., 2005, 53, 4, 1179-1184, https://doi.org/10.1021/jf040349w
. [all data]
Pino, Marbot, et al., 2005, 2
Pino, J.A.; Marbot, R.; Rosado, A.; Vázquez, C.,
Volatile constituents of Malay rose apple [Syzygium malaccense (L.) Merr. Perry],
Flavour Fragr. J., 2005, 20, 98-100. [all data]
Counet, Ouwerx, et al., 2004
Counet, C.; Ouwerx, C.; Rosoux, D.; Collin, S.,
Relationship between procyanidin and flavor contents of cocoa liquors from different origins,
J. Agric. Food Chem., 2004, 52, 20, 6243-6249, https://doi.org/10.1021/jf040105b
. [all data]
Garcia-Estaban, Ansorena, et al., 2004
Garcia-Estaban, M.; Ansorena, D.; Astiasaran, I.; Martin, D.; Ruiz, J.,
Comparison of simultaneous distillation extraction (SDE) and solid-phase microextraction (SPME) for the analysis of volatile compounds in dry-cured ham,
J. Sci. Food Agric., 2004, 84, 11, 1364-1370, https://doi.org/10.1002/jsfa.1826
. [all data]
Garcia-Estaban, Ansorena, et al., 2004, 2
Garcia-Estaban, M.; Ansorena, D.; Astiasarán, I.; Ruiz, J.,
Study of the effect of different fiber coatings and extraction conditions on dry cured ham volatile compounds extracted by solid-phase microextraction (SPME),
Talanta, 2004, 64, 2, 458-466, https://doi.org/10.1016/j.talanta.2004.03.007
. [all data]
Vinogradov, 2004
Vinogradov, B.A.,
Production, composition, properties and application of essential oils, 2004, retrieved from http://viness.narod.ru. [all data]
Bruce, Cork, et al., 2002, 2
Bruce, T.J.; Cork, A.; Hall, D.R.; Dunkelblum, E.,
Laboratory and field evaluation of floral odours from African marigold, Tagetes erecta, and sweet pea, Lathyrus odoratus, as kairomones for the cotton bollworm Helicoverpa armigera,
IOBC wprs Bull., 2002, 25, 1-9. [all data]
Counet, Callemien, et al., 2002
Counet, C.; Callemien, D.; Ouwerx, C.; Collin, S.,
Use of gas chromatography-olfactometry to identify key odorant compounds in dark chocolate. Comparison of samples before and after conching,
J. Agric. Food Chem., 2002, 50, 8, 2385-2391, https://doi.org/10.1021/jf0114177
. [all data]
David, Scanlan, et al., 2002
David, F.; Scanlan, F.; Sandra, P.; Szelewski, M.,
Analysis of essential oil compounds using retention time locked methods and retention time databases, 2002, retrieved from http://www.chem.agilent.com. [all data]
Guyot-Declerck, Renson, et al., 2002
Guyot-Declerck, C.; Renson, S.; Bouseta, A.; Collin, S.,
Floral quality and discrimination of Lavandula stoechas, Lavandula angustifolia, and Lavandula angustifolia × latifolia honeys,
Food Chem., 2002, 79, 4, 453-459, https://doi.org/10.1016/S0308-8146(02)00216-9
. [all data]
Jordán, Goodner, et al., 2002
Jordán, M.J.; Goodner, K.L.; Shaw, P.E.,
Characterization of the aromatic profile in aqueous essence and fruit juice of yellow passion fruit (Passiflora edulis Sims F. Flavicarpa degner) by GC-MS and GC/O,
J. Agric. Food Chem., 2002, 50, 6, 1523-1528, https://doi.org/10.1021/jf011077p
. [all data]
Lee and Kim, 2002
Lee, D.-S.; Kim, N.-S.,
Identification of fragrances from chestnut blossom by gas chromatography-ion trap mass spectrometry,
Bull. Korean Chem. Soc., 2002, 23, 11, 1647-1650, https://doi.org/10.5012/bkcs.2002.23.11.1647
. [all data]
Rapior, Breheret, et al., 2002
Rapior, S.; Breheret, S.; Talou T.; Pelissier, Y.; Bessiere, J.-M.,
The anise-like odor of Clitocybe odora, Lentinellus cochleatus and Agaricus essettei,
Mycologia, 2002, 94, 3, 373-376, https://doi.org/10.2307/3761770
. [all data]
Staples E.S., 2002
Staples E.S.,
The Chemistry of Black Tea Aroma, EST Internal Report, April, Electronic Sensor Technology, Newbury PAck, CA 91320, 2002, 16, retrieved from http://www.estcal.com/TechPapers/TeaSamples2.pdf. [all data]
Ansorena, Gimeno, et al., 2001
Ansorena, D.; Gimeno, O.; Astiasarán, I.; Bello, J.,
Analysis of volatile compounds by GC-MS of a dry fermented sausage: chorizo de Pamplona,
Food Res. Int., 2001, 34, 1, 67-75, https://doi.org/10.1016/S0963-9969(00)00133-2
. [all data]
Jordán, Shaw, et al., 2001
Jordán, M.J.; Shaw, P.E.; Goodner, K.L.,
Volatile components in aqueous essence and fresh fruit of Cucumis melo cv. Athena (muskmelon) by GC-MS and GC-O,
J. Agric. Food Chem., 2001, 49, 12, 5929-5933, https://doi.org/10.1021/jf010954o
. [all data]
Guyot, Scheirman, et al., 1999
Guyot, C.; Scheirman, V.; Collin, S.,
Floral origin markers of heather honeys: Calluna vulgaris and Erica arborea,
Food Chem., 1999, 64, 1, 3-11, https://doi.org/10.1016/S0308-8146(98)00122-8
. [all data]
Guyot, Bouseta, et al., 1998
Guyot, C.; Bouseta, A.; Scheirman, V.; Collin, S.,
Floral origin markers of chestnut and lime tree honeys,
J. Agric. Food Chem., 1998, 46, 2, 625-633, https://doi.org/10.1021/jf970510l
. [all data]
Kawasaki, Matsui, et al., 1998
Kawasaki, W.; Matsui, K.; Akakabe, Y.; Itai, N.; Kajiwara, T.,
Long-chain aldehyde-forming activity in tobacco leaves,
Phytochemistry, 1998, 49, 6, 1565-1568, https://doi.org/10.1016/S0031-9422(98)00236-2
. [all data]
Timón, Ventanas, et al., 1998
Timón, M.L.; Ventanas, J.; Martín, L.; Tejeda, J.F.; García, C.,
Volatile compounds in supercritical carbon dioxide extracts of Iberian ham,
J. Agric. Food Chem., 1998, 46, 12, 5143-5150, https://doi.org/10.1021/jf980652v
. [all data]
Zenkevich and Chupalov, 1996
Zenkevich, I.G.; Chupalov, A.A.,
New Possibilities of Chromato Mass Pectrometric Identification of Organic Compounds Using Increments of Gas Chromatographic Retention Indices of Molecular Structural Fragments,
Zh. Org. Khim. (Rus.), 1996, 32, 5, 656-666. [all data]
Buchbauer, Nikiforov, et al., 1994
Buchbauer, G.; Nikiforov, A.; Remberg, B.,
Headspace constituents of opium,
Planta Medica, 1994, 60, 2, 181-183, https://doi.org/10.1055/s-2006-959447
. [all data]
Garneau, Bouhajib, et al., 1994
Garneau, F.X.; Bouhajib, M.; Collin, G.J.; Gagnon, M.; ApSimon, J.W.,
The glycosidically bound volatile compounds of Picea mariana (Mill.) B.S.P.,
J. Essent. Oil Res., 1994, 6, 1, 43-46, https://doi.org/10.1080/10412905.1994.9698323
. [all data]
Jean, Garneau, et al., 1993
Jean, F.-I.; Garneau, F.-X.; Collin, G.J.; Bouhajib, M.; Zamir, L.O.,
The essential oil and glycosidically bound volatile compounds of Taxus canadensis marsh,
J. Essent. Oil Res., 1993, 5, 1, 7-11, https://doi.org/10.1080/10412905.1993.9698163
. [all data]
Blank, Fischer, et al., 1989
Blank, I.; Fischer, K.-H.; Grosch, W.,
Intensive neutral odourants of linden honey,
Z. Lebensm. Unters. Forsch., 1989, 189, 5, 426-433, https://doi.org/10.1007/BF01028316
. [all data]
Shibamoto, 1987
Shibamoto, T.,
Retention Indices in Essential Oil Analysis
in Capillary Gas Chromatography in Essential Oil Analysis, Sandra, P.; Bicchi, C., ed(s)., Hutchig Verlag, Heidelberg, New York, 1987, 259-274. [all data]
Zenkevich and Malamakhov, 1987
Zenkevich, I.G.; Malamakhov, A.C.,
Evaluation of Molecular Weights of Organic Compounds based on Retention Parameters at Chromato-Spectral Analysys. Additional Criterion of Molecular Ions' Identification,
Vestn. St. Petersb. Univ. Ser. 4: Fiz. Khim, 1987, 2, 101-106. [all data]
Waggott and Davies, 1984
Waggott, A.; Davies, I.W.,
Identification of organic pollutants using linear temperature programmed retention indices (LTPRIs) - Part II, 1984, retrieved from http://dwi.defra.gov.uk/research/completed-research/reports/dwi0383.pdf. [all data]
Fagan, Kepner, et al., 1982
Fagan, G.L.; Kepner, R.E.; Webb, A.D.,
Additional volatile components of Palomino film sherry,
Am. J. Enol. Vitic, 1982, 33, 1, 47-50. [all data]
Ardrey and Moffat, 1981
Ardrey, R.E.; Moffat, A.C.,
Gas-liquid chromatographic retention indices of 1318 substances of toxicological interest on SE-30 or OV-1 stationary phase,
J. Chromatogr., 1981, 220, 3, 195-252, https://doi.org/10.1016/S0021-9673(00)81925-1
. [all data]
Wanakhachornkrai and Lertsiri, 9999
Wanakhachornkrai, P.; Lertsiri, S.,
Comparison of determination method for volatile compounds in Thai soy sauce,
Analytical, Nutritional and Clinical Methods, 9999, 1-11. [all data]
Kiss, Csoka, et al., 2011
Kiss, M.; Csoka, M.; Gyorfi, J.; Korany, K.,
Comparison of the fragrance constituents of Tuber aestivium and Tuber Brumale gathered in Hungary,
J. Appl. Botany Food Quality, 2011, 84, 102-110. [all data]
Duarte, Dias, et al., 2010
Duarte, W.F.; Dias, D.R.; Oliveira, J.M.; Teixeira, J.A.; de Almeida e Silva, J.B.; Schwan, R.F.,
Characterization of different fruit wines made from cacao,cupuassu, gabiroba, jaboticaba and umbu,
Food Sci. Technol., 2010, 43, 1564-1572. [all data]
Moon and Shibamoto, 2010
Moon, J.-K.; Shibamoto, T.,
Formation of volatile chemicals from thermal degradation of less volatile cofee components: quinic acid, caffeic acid, and chlorogenic acid,
J. Agric. Food Chem., 2010, 58, 9, 5465-5470, https://doi.org/10.1021/jf1005148
. [all data]
Birtic, Ginies, et al., 2009
Birtic, S.; Ginies, C.; Causse, M.; Renard, C.M.G.C.; Page, D.,
Changes in volatiles and glycosides during fruit maturartion of two contrasted tomato (Solanum lycopersicum) lines,
J. Agric. Food Chem., 2009, 57, 2, 591-598, https://doi.org/10.1021/jf8023062
. [all data]
Mo, Fan, et al., 2009
Mo, X.; Fan, W.; Xu, Y.,
Changes in volatile compounds of Chinese rice wine wheat qu during fermentation and storage,
J. of the Institute of Brewing, 2009, 115, 4, 300-307, https://doi.org/10.1002/j.2050-0416.2009.tb00385.x
. [all data]
Zhao, Xu, et al., 2009
Zhao, Y.; Xu, Y.; Li, J.; Fan, W.; Jiang, W.,
Profile of volatile compounds in 11 brandies by headspace solid-phase microextraction followed by gas chromatography-mass spectrometry,
J. Food. Sci., 2009, 74, 2, c90-c99, https://doi.org/10.1111/j.1750-3841.2008.01029.x
. [all data]
Kaypak and Avsar, 2008
Kaypak, D.; Avsar, Y.K.,
Volatile and odor-active compounds of tuzlu yoghurt,
Asian J. Chem., 2008, 20, 5, 3641-3648. [all data]
Soria, Sanz, et al., 2008
Soria, A.C.; Sanz, J.; Martinez-Castro, I.,
SPME followed by GC-MS: a powerful technique for qualitative analysis of honey volatiles,
Eur. Food Res. Technol., 2008, 1-12. [all data]
Cros, Vandanjon, et al., 2007
Cros, S.; Vandanjon, L.; Jaouen, P.; Bourseau, P.,
Processing of Industrial Mussel Cooking Juices by Reverse Osmotis: Pollution Abatement and Aromas Recovery, 2007, retrieved from title of Internet file: [imstec064]. [all data]
Povolo, Contarini, et al., 2007
Povolo, M.; Contarini, G.; Mele, M.; Secchiari, P.,
Study on the influence of pasture on volatile fraction of Ewes' dairy products by solid-phase microextraction and gas chromatography-mass spectrometry,
J. Dairy Sci., 2007, 90, 2, 556-569, https://doi.org/10.3168/jds.S0022-0302(07)71539-4
. [all data]
Wei A. and Shibamoto T., 2007
Wei A.; Shibamoto T.,
Antioxidant activities and volatile constituents of various essential oils,
J. Agric. Food Chem., 2007, 55, 5, 1737-1742, https://doi.org/10.1021/jf062959x
. [all data]
Fan and Qian, 2006
Fan, W.; Qian, M.C.,
Characterization of Aroma Compounds of Chinese Wuliangye and Jiannanchun Liquors by Aroma Extract Dilution Analysis,
J. Agric. Food Chem., 2006, 54, 7, 2695-2704, https://doi.org/10.1021/jf052635t
. [all data]
Ibarz, Ferreira, et al., 2006
Ibarz, M.J.; Ferreira, V.; Hernández-Orte, P.; Loscos, N.; Cacho, J.,
Optimization and evaluation of a procedure for the gas chromatographic-mass spectrometric analysis of the aromas generated by fast acid hydrolysis of flavor precursors extracted from grapes,
J. Chromatogr. A, 2006, 1116, 1-2, 217-229, https://doi.org/10.1016/j.chroma.2006.03.020
. [all data]
Komes, Ulrich, et al., 2006
Komes, D.; Ulrich, D.; Lovric, T.,
Characterization of odor-active compounds in Croatian Rhine Riesling wine, subregion Zagorje,
Eur. Food Res. Technol., 2006, 222, 1-2, 1-7, https://doi.org/10.1007/s00217-005-0094-y
. [all data]
de la Fuente, Martinez-Castro, et al., 2005
de la Fuente, E.; Martinez-Castro, I.; Sanz, J.,
Characterization of Spanish unifloral honeys by solid phase microextraction and gas chromatography-mass spectrometry,
J. Sep. Sci., 2005, 28, 9-10, 1093-1100, https://doi.org/10.1002/jssc.200500018
. [all data]
Joichi, Yomogida, et al., 2005
Joichi, A.; Yomogida, K.; Awano, K.; Ueda, Y.,
Volatile components of tea-scented modern roses and ancient Chinese roses,
Flavour Fragr. J., 2005, 20, 2, 152-157, https://doi.org/10.1002/ffj.1388
. [all data]
Ka, Choi, et al., 2005
Ka, M.-H.; Choi, E.H.; Chun, H.-S.; Lee, K.-G.,
Antioxidative Activity of Volatile Extracts Isolated from Angelica tenuissimae Roots, Peppermint Leaves, Pine Needles, and Sweet Flag Leaves,
J. Agric. Food Chem., 2005, 53, 10, 4124-4129, https://doi.org/10.1021/jf047932x
. [all data]
Krings, Brauer, et al., 2005
Krings, U.; Brauer, B.; Kaspera, R.; Berger, R.G.,
Biotransformation of gamma-terpinene using Stemphylium botryosum (Wallroth) yields p-mentha-1,4-dien-9-ol, a novel odorous monoterpenol,
Biocatal. Biotransform., 2005, 23, 6, 457-463, https://doi.org/10.1080/10242420500444267
. [all data]
Kulisic, Radonic, et al., 2005
Kulisic, T.; Radonic, A.; Milos, M.,
Inhibition of Lard Oxidation by Fractions of Different Essential Oil,
Grasas y Aceites, 2005, 56, 4, 284-291, https://doi.org/10.3989/gya.2005.v56.i4.94
. [all data]
Lee, Umano, et al., 2005
Lee, S.-J.; Umano, K.; Shibamoto, T.; Lee, K.-G.,
Identification of volatile components in basil (Ocimum basilicum L.) and thyme leaves (Thymus vulgaris L.) and their antioxidant properties,
Food Chem., 2005, 91, 1, 131-137, https://doi.org/10.1016/j.foodchem.2004.05.056
. [all data]
Qian and Wang, 2005
Qian, M.C.; Wang, Y.,
Seasonal Variations of Volatile Composition and Odor Activity Value of Marion (Rubus spp. hyb) and Thornless Evergreen (R.laciniatus L.) Blackberries,
J. Food. Sci., 2005, 70, 1, c13-c20, https://doi.org/10.1111/j.1365-2621.2005.tb09013.x
. [all data]
Rohloff and Bones, 2005
Rohloff, J.; Bones, A.M.,
Volatile profiling of Arabidopsis thaliana - Putative olfactory compounds in plant communication,
Phytochemistry, 2005, 66, 16, 1941-1955, https://doi.org/10.1016/j.phytochem.2005.06.021
. [all data]
Yao, Guo, et al., 2005
Yao, S.-S.; Guo, W.-F.; Lu, Y.; Jiang, Y.-X.,
Flavor Characteristics of Lapsang Souchong and Smoked Lapsang Souchong, a Special Chinese Black Tea with Pine Smoking Process,
J. Agric. Food Chem., 2005, 53, 22, 8688-8693, https://doi.org/10.1021/jf058059i
. [all data]
Chida, Sone, et al., 2004
Chida, M.; Sone, Y.; Tamura, H.,
Aroma characteristics of stored tobacco cut leaves analyzed by a high vacuum distillation and canister system,
J. Agric. Food Chem., 2004, 52, 26, 7918-7924, https://doi.org/10.1021/jf049223p
. [all data]
Jiang and Kubota, 2004
Jiang, L.; Kubota, K.,
Differences in the volatile components and their odor characteristics of green and ripe fruits and dried pericarp of Japanese pepper (Xanthoxylum piperitum DC.),
J. Agric. Food Chem., 2004, 52, 13, 4197-4203, https://doi.org/10.1021/jf030663a
. [all data]
López, Ezpeleta, et al., 2004
López, R.; Ezpeleta, E.; Sánchez, I.; Cacho, J.; Ferreira, V.,
Analysis of the aroma intensities of volatile compounds released from mild acid hydrolysates of odourless precursors extracted from Tempranillo and Grenache grapes using gas chromatography-olfactometry,
Food Chem., 2004, 88, 1, 95-103, https://doi.org/10.1016/j.foodchem.2004.01.025
. [all data]
Narain, Almeida, et al., 2004
Narain, N.; Almeida, J.N.; Galvão, M.S.; Madruga, M.S.; de Brito, E.S.,
Volatile compounds in passion fruit (Passiflora edulis forma Flavicarpa) and yellow mombin (Spondias mombin L.) fruits obtained by dynamic headspace technique,
Cienc. Tecnol. Aliment. Campinas, 2004, 24, 2, 212-216, https://doi.org/10.1590/S0101-20612004000200009
. [all data]
Soria, Gonzalez, et al., 2004
Soria, A.C.; Gonzalez, M.; de Lorenzo, C.; Martinez-Castro, I.; Sanza, J.,
Characterization of artisanal honeys from Madrid (Central Spain) on the basis of their melissopalynological, physicochemical and volatile composition data,
Food Chem., 2004, 85, 1, 121-130, https://doi.org/10.1016/j.foodchem.2003.06.012
. [all data]
Cros, Vandanjon, et al., 2003, 2
Cros, S.; Vandanjon, L.; Jaouen, P.; Bourseau, P.,
IMSTEC'03 Conference Proceedings, Processing of industrial mussel cooking juices by reverse osmosis: pollution abatement and aromas recovery, Universoty of New South Wales, Sydney, Australia, 2003, 6. [all data]
Dregus and Engel, 2003
Dregus, M.; Engel, K.-H.,
Volatile constituents of uncooked Rhubarb (Rheum rhabarbarum L.) stalks,
J. Agric. Food Chem., 2003, 51, 22, 6530-6536, https://doi.org/10.1021/jf030399l
. [all data]
Lin, Cai, et al., 2003
Lin, P.; Cai, J.; Li, J.; Sang, W.; Su, Q.,
Constituents of the essential oil of Hemerocallis flava day lily,
Flavour Fragr. J., 2003, 18, 6, 539-541, https://doi.org/10.1002/ffj.1264
. [all data]
Miyazawa and Okuno, 2003
Miyazawa, M.; Okuno, Y.,
Volatile components from the roots of Scrophularia ningpoensis Hemsl.,
Flavour Fragr. J., 2003, 18, 5, 398-400, https://doi.org/10.1002/ffj.1232
. [all data]
Miyazawa, Yamafuji, et al., 2003
Miyazawa, M.; Yamafuji, C.; Kurose, K.; Ishikawa, Y.,
Volatile components of the rhizomes of Cirsium japonicum DC,
Flavour Fragr. J., 2003, 18, 1, 15-17, https://doi.org/10.1002/ffj.1135
. [all data]
Saura, LAencina, et al., 2003
Saura, D.; LAencina, J.; Perez-Lopez, A.J.; Lizama, V.; Carbonell-Barrachina, A.A.,
Aroma of canned peach halves acidified with clarified lemon juice,
J. Food Sci., 2003, 68, 3, 1080-1085, https://doi.org/10.1111/j.1365-2621.2003.tb08292.x
. [all data]
Soria, Martinez-Castro, et al., 2003
Soria, A.C.; Martinez-Castro, I.; Sanz, J.,
Analysis of volatile composition of honey by solid phase microextraction and gas chromatographymass spectrometry,
J. Sep. Sci., 2003, 26, 9-10, 793-801, https://doi.org/10.1002/jssc.200301368
. [all data]
Tanaka, Yamauchi, et al., 2003
Tanaka, T.; Yamauchi, T.; Katsumata, R.; Kiuchi, K.,
Comparison of volatile components in commercial Itohiki-Natto by solid phase microextraction and gas chromatography,
Nippon Shokuhin Kagaku Kogaku Kaishi, 2003, 50, 6, 278-285, https://doi.org/10.3136/nskkk.50.278
. [all data]
Vichi, Castellote, et al., 2003
Vichi, S.; Castellote, A.I.; Pizzale, L.; Conte, L.S.; Buxaderas, S.; López-Tamames, E.,
Analysis of virgin olive oil volatile compounds by headspace solid-phase microextraction coupled to gas chromatography with mass spectrometric and flame ionization detection,
J. Chromatogr. A, 2003, 983, 1-2, 19-33, https://doi.org/10.1016/S0021-9673(02)01691-6
. [all data]
Wanakhachornkrai and Lertsiri, 2003
Wanakhachornkrai, P.; Lertsiri, S.,
Analytical, nutritional, and clinical methods. Comparison of determination method for volatile compounds in Thai soy sauce,
Food Chem., 2003, 83, 4, 619-629, https://doi.org/10.1016/S0308-8146(03)00256-5
. [all data]
Fu, Yoon, et al., 2002
Fu, S.-G.; Yoon, Y.; Basemore, R.,
Aroma-actie components in fermented bamboo shoots,
J. Agric. Food Chem., 2002, 50, 3, 549-554, https://doi.org/10.1021/jf010883t
. [all data]
Hayata, Sakamoto, et al., 2002
Hayata, Y.; Sakamoto, T.; Kozuka, H.; Sakamoto, K.; Osajima, Y.,
Analysis of aromatic volatile compounds in 'Miyabi' melon (Cucumis melo L.) using the Porapak Q column,
J. Jpn. Soc. Hortic. Sci., 2002, 71, 4, 517-525, https://doi.org/10.2503/jjshs.71.517
. [all data]
Ito, Sugimoto, et al., 2002
Ito, Y.; Sugimoto, A.; Kakuda, T.; Kubota, K.,
Identification of potent odorants in Chinese jasmine green tea scented with flowers of Jasminum sambac,
J. Agric. Food Chem., 2002, 50, 17, 4878-4884, https://doi.org/10.1021/jf020282h
. [all data]
Lecanu, Ducruet, et al., 2002
Lecanu, L.; Ducruet, V.; Jouquand, C.; Gratadoux, J.J.; Feigenbaum, A.,
Optimization of headspace solid-phase microextraction (SPME) for the odor analysis of surface-ripened cheese,
J. Agric. Food Chem., 2002, 50, 13, 3810-3817, https://doi.org/10.1021/jf0117107
. [all data]
Osorio, Duque, et al., 2002
Osorio, C.; Duque, C.; Suarez, M.; Salamanca, L.E.; Uruena, F.,
Free, glycosidically bound, and phosphate bound flavor constituents of badea (Passiflora quadrangularis) fruit pulp,
J. Sep. Sci., 2002, 25, 3, 147-154, https://doi.org/10.1002/1615-9314(20020201)25:3<147::AID-JSSC147>3.0.CO;2-G
. [all data]
Suhardi, Suzuki, et al., 2002
Suhardi, S.; Suzuki, M.; Yoshida, K.; Muto, T.; Fujita, A.; Watanbe, N.,
Changes in the volatile compounds and in the chemical and physical properties of snake fruit (Salacca edulis Reinw) Cv. Pondoh during maturation,
J. Agric. Food Chem., 2002, 50, 26, 7627-7633, https://doi.org/10.1021/jf020620e
. [all data]
Umano, Hagi, et al., 2002
Umano, K.; Hagi, Y.; Shibamoto, T.,
Volatile chemicals identified in extracts from newly hybrid citrus, dekopon (Shiranuhi mandarin Suppl. J.),
J. Agric. Food Chem., 2002, 50, 19, 5355-5359, https://doi.org/10.1021/jf0203951
. [all data]
Ducruet, Fournier, et al., 2001
Ducruet, V.; Fournier, N.; Saillard, P.; Feigenbaum, A.; Guichard, E.,
Influence of packaging on the aroma stability of strawberry syrup during shelf life,
J. Agric. Food Chem., 2001, 49, 5, 2290-2297, https://doi.org/10.1021/jf0012796
. [all data]
Jiang, Kojima, et al., 2001
Jiang, L.; Kojima, H.; Yamada, K.; Kobayashi, A.; Kubota, K.,
Isolation of some glycosides as aroma precursors in young leaves of Japanese pepper (Xanthoxylum piperitum DC.),
J. Agric. Food Chem., 2001, 49, 12, 5888-5894, https://doi.org/10.1021/jf0104937
. [all data]
Lee and Shibamoto, 2001
Lee, K.-G.; Shibamoto, T.,
Antioxidant property of aroma extract isolated from clove buds [Syzygium aromaticum (L.) Merr. et Perry],
Food Chem., 2001, 74, 4, 443-448, https://doi.org/10.1016/S0308-8146(01)00161-3
. [all data]
Vernin, Lageot, et al., 2001
Vernin, G.; Lageot, C.; Gaydou, E.M.; Parkanyi, C.,
Analysis of the essential oil of Lippia graveolens HBK from El Salvador,
Flavour Fragr. J., 2001, 16, 3, 219-226, https://doi.org/10.1002/ffj.984
. [all data]
Weckerle, Bastl-Borrmann, et al., 2001
Weckerle, B.; Bastl-Borrmann, R.; Richling, E.; Hör, K.; Ruff, C.; Schreier, P.,
Cactus pear (Opuntia ficus indica) flavour constituents - chiral evaluation (MDGC-MS) and isotope ratio (HRGC-IRMS) analysis,
Flavour Fragr. J., 2001, 16, 5, 360-363, https://doi.org/10.1002/ffj.1012
. [all data]
Buttery, Light, et al., 2000
Buttery, R.G.; Light, D.M.; Nam, Y.; Merrill, G.B.; Roitman, J.N.,
Volatile components of green walnut husks,
J. Agric. Food Chem., 2000, 48, 7, 2858-2861, https://doi.org/10.1021/jf000288b
. [all data]
Lee and Shibamoto, 2000
Lee, K.-G.; Shibamoto, T.,
Antioxidant properties of aroma compounds isolated from soybeans and mung beans,
J. Agric. Food Chem., 2000, 48, 9, 4290-4293, https://doi.org/10.1021/jf000442u
. [all data]
Morales, Duque, et al., 2000
Morales, A.L.; Duque, C.; Bautista, E.,
Identification of free and glycosidically bound volatiles and glycosides by capillary GC and capillary GC-MS in Lulo del Chocó (Solanum topiro),
J. Hi. Res. Chromatogr., 2000, 23, 5, 379-385, https://doi.org/10.1002/(SICI)1521-4168(20000501)23:5<379::AID-JHRC379>3.0.CO;2-B
. [all data]
Parada, Duque, et al., 2000
Parada, F.; Duque, C.; Fujimoto, Y.,
Free and bound volatile composition and characterization of some glucoconjugates as aroma precursors in Melón de olor fruit pulp (Sicana odorifera),
J. Agric. Food Chem., 2000, 48, 12, 6200-6204, https://doi.org/10.1021/jf0007232
. [all data]
Umano, Hagi, et al., 2000
Umano, K.; Hagi, Y.; Nakahara, K.; Shoji, A.; Shibamoto, T.,
Volatile chemicals identified in extracts from leaves of Japanese mugwort (Artemisia princeps Pamp.),
J. Agric. Food Chem., 2000, 48, 8, 3463-3469, https://doi.org/10.1021/jf0001738
. [all data]
Hirose, Joichi, et al., 1999
Hirose, S.; Joichi, A.; Nakamura, S.; Awano, K.,
Volatile components of musky scent of orchids,
Flavour Fragr. J., 1999, 14, 3, 183-184, https://doi.org/10.1002/(SICI)1099-1026(199905/06)14:3<183::AID-FFJ804>3.0.CO;2-S
. [all data]
Hwan and Chou, 1999
Hwan, C.-H.; Chou, C.-C.,
Volatile components of the Chinese fermented soya bean curd as affected by the addition of ethanol in ageing solution,
J. Sci. Food Agric., 1999, 79, 2, 243-248, https://doi.org/10.1002/(SICI)1097-0010(199902)79:2<243::AID-JSFA179>3.0.CO;2-I
. [all data]
Umano, Nakahara, et al., 1999
Umano, K.; Nakahara, K.; Shoji, A.; Shibamoto, T.,
Aroma chemicals isolated and identified from leaves of aloe arborescens Mill. Var. natalensis Berger,
J. Agric. Food Chem., 1999, 47, 9, 3702-3705, https://doi.org/10.1021/jf990116i
. [all data]
Parada and Duque, 1998
Parada, F.; Duque, C.,
Studies on the aroma of piñuela fruit pulp (Bromelia plumieri): Free and bound volatile composition and characterization of some glucoconjugates as aroma precursors,
J. Hi. Res. Chromatogr., 1998, 21, 10, 577-581, https://doi.org/10.1002/(SICI)1521-4168(19981001)21:10<577::AID-JHRC577>3.0.CO;2-V
. [all data]
Petersen, Poll, et al., 1998
Petersen, M.A.; Poll, L.; Larsen, L.M.,
Comparison of volatiles in raw and boiled potatoes using a mild extraction technique combined with GC odour profiling and GC-MS,
Food Chem., 1998, 61, 4, 461-466, https://doi.org/10.1016/S0308-8146(97)00119-2
. [all data]
Ravichandran and Parthiban, 1998
Ravichandran, R.; Parthiban, R.,
The impact of processing techniques on tea volatiles,
Food Chem., 1998, 62, 3, 347-353, https://doi.org/10.1016/S0308-8146(97)00229-X
. [all data]
Awano, Honda, et al., 1997
Awano, K.; Honda, T.; Ogawa, T.; Suzuki, S.; Matsunaga, Y.,
Volatile components of Phalaenopsis schilleriana Rehb. f.,
Flavour Fragr. J., 1997, 12, 5, 341-344, https://doi.org/10.1002/(SICI)1099-1026(199709/10)12:5<341::AID-FFJ657>3.0.CO;2-L
. [all data]
Sekiwa, Kubota, et al., 1997
Sekiwa, Y.; Kubota, K.; Kobayashi, A.,
Characteristic flavor components in the brew of cooked clam (Meretrix lusoria) and the effect of storage on flavor formation,
J. Agric. Food Chem., 1997, 45, 3, 826-830, https://doi.org/10.1021/jf960433e
. [all data]
Wada and Shibamoto, 1997
Wada, K.; Shibamoto, T.,
Isolation and identification of volatile compounds from a wine using solid phase extraction, gas chromatography, and gas chromatography/mass spectrometry,
J. Agric. Food Chem., 1997, 45, 11, 4362-4366, https://doi.org/10.1021/jf970157j
. [all data]
Kubota, Matsujage, et al., 1996
Kubota, K.; Matsujage, Y.; Sekiwa, Y.; Kobayashi, A.,
Identification of the characteristic volatile flavor compounds formed by cooking squid (Todarodes pacificus Steenstrup),
Food Sci. Technol., 1996, 2, 3, 163-166. [all data]
Morales, Albarracín, et al., 1996
Morales, A.L.; Albarracín, D.; Rodríguez, J.; Duque, C.; Riaño, L.E.; Espitia, J.,
Volatile constituents from Andes berry (Rubus glaucus Benth),
J. Hi. Res. Chromatogr., 1996, 19, 10, 585-587, https://doi.org/10.1002/jhrc.1240191011
. [all data]
Pollak and Berger, 1996
Pollak, F.C.; Berger, R.G.,
Geosmin and Related Volatiles in Bioreactor-Cultured Streptomyces citreus CBS 109.60,
Appl. Environ. Microbiol., 1996, 62, 4, 1295-1299. [all data]
Shuichi, Masazumi, et al., 1996
Shuichi, H.; Masazumi, N.; Hiromu, K.; Kiyoshi, F.,
Comparison of volatile compounds berween the crude drugs, Onji-tsutsu and Onji-niki,
Nippon nogei kagaku kaishi, 1996, 70, 2, 151-160. [all data]
Kawakami, Ganguly, et al., 1995
Kawakami, M.; Ganguly, S.N.; Banerjee, J.; Kobayashi, A.,
Aroma composition of oolong tea and black tea by brewed extraction method and characterizing compounds of Darjeeling tea aroma,
J. Agric. Food Chem., 1995, 43, 1, 200-207, https://doi.org/10.1021/jf00049a037
. [all data]
Togari, Kobayashi, et al., 1995
Togari, N.; Kobayashi, A.; Aishima, T.,
Pattern recognition applied to gas chromatographic profiles of volatile components in three tea categories,
Food Res. Int., 1995, 28, 5, 495-502, https://doi.org/10.1016/0963-9969(95)00029-1
. [all data]
Kawakami, Kobayashi, et al., 1993
Kawakami, M.; Kobayashi, A.; Kator, K.,
Volatile constituents of Rooibos tea (Aspalathus linearis) as affected by extraction process,
J. Agric. Food Chem., 1993, 41, 4, 633-636, https://doi.org/10.1021/jf00028a023
. [all data]
Hatsuko, Kazuko, et al., 1992
Hatsuko, S.; Kazuko, H.; Masayoshi, K.; Yoshiaki, I.,
Improvement of quality of likorine extract by heat treatment,
J. Food Sci. Technol., 1992, 39, 11, 976-983, https://doi.org/10.3136/nskkk1962.39.976
. [all data]
Kawakami and Kobayashi, 1991
Kawakami, M.; Kobayashi, A.,
Volatitle constituents of greem mate and roasted mate,
J. Agric. Food Chem., 1991, 39, 7, 1275-1279, https://doi.org/10.1021/jf00007a016
. [all data]
Kubota, Nakamoto, et al., 1991
Kubota, K.; Nakamoto, A.; Moriguchi, M.; Kobayashi, A.; Ishii, H.,
Formation of pyrrolidino[1,2-e]-4H-2,4-dimethyl-1,3,5-dithiazine in the volatiles of boiled short-necked clam, clam, and corbicula,
J. Agric. Food Chem., 1991, 39, 6, 1127-1130, https://doi.org/10.1021/jf00006a027
. [all data]
Loughrin, Hamilton-Kemp, et al., 1990
Loughrin, J.H.; Hamilton-Kemp, T.R.; Andersen, R.A.; Hildebrand, D.F.,
Headspace compounds from flowers of Nicotiana tabacum and related species,
J. Agric. Food Chem., 1990, 38, 2, 455-460, https://doi.org/10.1021/jf00092a027
. [all data]
Hamilton-Kemp, Andersen, et al., 1988
Hamilton-Kemp, T.R.; Andersen, R.A.; Rodriguez, J.G.; Loughrin, J.H.; Patterson, C.G.,
Strawberry foliage headspace vapor components at periods of susceptability and resistance to Tetranychus urticae Koch,
J. Chem. Ecol., 1988, 14, 3, 789-796, https://doi.org/10.1007/BF01018773
. [all data]
Mihara, Tateba, et al., 1988
Mihara, S.; Tateba, H.; Nishimura, O.; Machii, Y.; Kishino, K.,
The volatile components of Chinese quince (Pseudocydonia sinensis Schneid)
in Flavors and Fragrances: A World Perspective. Proceedings of the 10th International Congress of Essential Oils, Fragrances and Flavors, Lawrence,B.M.; Mookherjee,B.D.; Willis,B.J., ed(s)., Elsevier, New York, 1988, 537-550. [all data]
Takeoka, Flath, et al., 1988
Takeoka, G.R.; Flath, R.A.; Güntert, M.; Jennings, W.,
Nectarine volatiles: vacuum steam distillation versus headspace sampling,
J. Agric. Food Chem., 1988, 36, 3, 553-560, https://doi.org/10.1021/jf00081a037
. [all data]
Andersen J.F., Mikolajczak K.L., et al., 1987
Andersen J.F.; Mikolajczak K.L.; Reed D.K.,
Analysis of peach bark volatiles and their electroantennogram activity with lesser pechtree borer, Synanthedon pictipes (Grote and Robinson),
J. Chem. Ecol., 1987, 13, 11, 2103-2114, https://doi.org/10.1007/BF01012874
. [all data]
Buttery, Ling, et al., 1987
Buttery, R.G.; Ling, L.C.; Light, D.M.,
Tomato leaf volatile aroma components,
J. Agric. Food Chem., 1987, 35, 6, 1039-1042, https://doi.org/10.1021/jf00078a043
. [all data]
Mihara, Tateba, et al., 1987
Mihara, S.; Tateba, H.; Nishimura, O.; Machii, Y.; Kishino, K.,
Volatile components of Chinese quince (Pseudocydonia sinensis Schneid),
J. Agric. Food Chem., 1987, 35, 4, 532-537, https://doi.org/10.1021/jf00076a023
. [all data]
Stancher and Pertoldi, 1967
Stancher, B.; Pertoldi, M.G.,
Characterization of commercial materials used in synthetic essential oil production. Identification and gas-chromatographic determination of impurities,
Rassegna chimica, 1967, 19, 3, 99-109. [all data]
Gyawali and Kim, 2012
Gyawali, R.; Kim, K.-S.,
Bioactive volatile compounds of three medicinal plants from Nepal,
Kathmandu Univ. J. Sci., Engineering and Technol., 2012, 8, 1, 51-62. [all data]
Toontom, Meenune, et al., 2012
Toontom, N.; Meenune, M.; Posri, W.; Lertsiri, S.,
Effect of drying method on physical and chemical quality, hotness and volatile flavour characteristics of dried chili,
Int. Food Res. J., 2012, 19, 3, 1023-1031. [all data]
Welke, Manfroi, et al., 2012
Welke, J.E.; Manfroi, V.; Zanus, M.; Lazarotto, M.; Zini, C.A.,
Characterization of the volatile profile of Brazilian merlot wines through comprehensive two dimensional gas chromatography time-of-flight mass spectrometric detection,
J. Chromatogr. A, 2012, 1226, 124-139, https://doi.org/10.1016/j.chroma.2012.01.002
. [all data]
Johanningsmeier and McFeeters, 2011
Johanningsmeier, S.D.; McFeeters, R.F.,
Detection of volatile spoilage metabolites in fermented cucumbers using nontargeted, comprehensive 2-dimensional gas chromatography-time-of-flight mass spectrometry (GCxGCxTOFMS),
J. Food Sci., 2011, 76, 1, c168-c177, https://doi.org/10.1111/j.1750-3841.2010.01918.x
. [all data]
Noorizadeh, Farmany, et al., 2011
Noorizadeh, H.; Farmany, A.; Noorizadeh, M.,
Quantitative structure-retention relationships analysis of retention index of essential oils,
Quim. Nova, 2011, 34, 2, 242-249, https://doi.org/10.1590/S0100-40422011000200014
. [all data]
Xiao, Dai, et al., 2011
Xiao, Z.; Dai, S.; Niu, Y.; Yu, H.; Zhu, J.; Tian, H.; Gu, Y.,
Discrimination of Chinese vinegars based on headspace solid-phase microextraction - gas chromatography mass spectrometry of volatile compounds and multivariate analysis,
J. Food Sci., 2011, 76, 8, c1125-c1135, https://doi.org/10.1111/j.1750-3841.2011.02356.x
. [all data]
Parker, Tsormpatsidis, et al., 2010
Parker, J.K.; Tsormpatsidis, E.; Elmore, J.S.; Wagstaffe, A.; Mottram, D.S.,
Solid-phase extraction as a routine method for comparing key aroma compounds in fruits
in Expression of Multidisciplinary Flavour Science, Blank, I.; Wust, M.; Yeretzian C., ed(s)., Zurcher Hochschule fur Angewandte Wissenschaften, Wadenswil, Switzerland, 2010, 521-524. [all data]
Vekiari, Orepoulou, et al., 2010
Vekiari, S.A.; Orepoulou, V.; Kourkoutas, Y.; Kamoun, N.; Msallem, M.; Psimouli, V.; Arapoglou, D.,
Characterization and seasonal variations of the quality of virgin olive oil of the Thoumbolia and Koroneiki varieties from Southern Greece,
Grasas y Aceites, 2010, 61, 3, 221-231, https://doi.org/10.3989/gya.108709
. [all data]
Chinnici, Guerrero, et al., 2009
Chinnici, F.; Guerrero, E.D.; Sonni, F.; Natali, N.; Marin, R.N.; Riponi, C.,
Gas chromatography - mass spectrometry (GC-MS) characterization of volatile compounds in quality vinegars with protected Europian geographical indication,
J. Agric. Food Chem., 2009, 57, 11, 4784-4792, https://doi.org/10.1021/jf804005w
. [all data]
Frauendorfer and Schieberle, 2008
Frauendorfer, F.; Schieberle, P.,
Changes in key aroma compounds of criollo cocoa beans during roasting,
J. Agric. Food Chem., 2008, 56, 21, 10244-10251, https://doi.org/10.1021/jf802098f
. [all data]
Tao, Wenlai, et al., 2008
Tao, L.; Wenlai, F.; Yan, X.,
Characterization of volatile and semi-volatile compounds in Chinese rica wines by headspace solid phase microextraction followed by gas chromatography - mass spectrometry,
J. Inst. Brew., 2008, 114, 2, 172-179, https://doi.org/10.1002/j.2050-0416.2008.tb00323.x
. [all data]
Yongsheng, Hua, et al., 2008
Yongsheng, T.; Hua, L.; Hua, W.; Li, Z.,
Volatile composition of young Cabernet Savignon red wine from Changli Counti (China),
J. Food Composition and Analysis, 2008, 21, 8, 689-694, https://doi.org/10.1016/j.jfca.2008.05.007
. [all data]
Zhang, Zhang, et al., 2008
Zhang, C.; Zhang, H.; Wang, L.; Guo, X.,
Effect of carrot (Daucus carota) antifreeze proteins on texture preperties of frozen dough and volatile compounds of crumb,
Food. Sci. Technol. (Lebesmittel-Wissenschaft und Technologie), 2008, 41, 6, 1029-1036, https://doi.org/10.1016/j.lwt.2007.07.010
. [all data]
Chaieb, Hajlaoui, et al., 2007
Chaieb, K.; Hajlaoui, H.; Zmantar, T.; Ben Kahla-Nakbi, A.; Rouabhia, M.; Mahdouani, K.; Bakhrouf, A.,
The chemical composition and biological activity of clove essential oil, Eugenia caryophyllata (Syzigium aromaticum L. Myrtaceae): a short review,
Phytoterapy Res., 2007, 21, 6, 501-506, https://doi.org/10.1002/ptr.2124
. [all data]
Loskos, Hernandez-Orte, et al., 2007
Loskos, N.; Hernandez-Orte, P.; Cacho, J.; Ferreira, V.,
Release and formation of varietal aroma compounds during alcoholic fermentation from nonfloral grape odorless flavor precursors fractions,
J. Agric. Food Chem., 2007, 55, 16, 6674-6684, https://doi.org/10.1021/jf0702343
. [all data]
Narain, Galvao, et al., 2007
Narain, N.; Galvao, M. deS.; Ferreira, D.DaS.; Navarro, D.M.A.F.,
Flavor biogeneration in Mangaba (Hancornia speciosa Gomes) fruit,
BioEng. Campinas, 2007, 1, 1, 25-31. [all data]
Selli, 2007
Selli, S.,
Volatile constituents of orange obtained from moro oranges (Citrus Sinensis L. Osbeck),
J. Food Quality, 2007, 30, 3, 330-341, https://doi.org/10.1111/j.1745-4557.2007.00124.x
. [all data]
Tian, Zhang, et al., 2007
Tian, Y.; Zhang, X.; Huang, T.; Zou, K.; Zhou, J.,
Research advances on the essential oils from leaves of Eucalyptus,
Food Fermentation Ind. (Chinese), 2007, 33, 10, 143-147. [all data]
Vichi, Guadayol, et al., 2007
Vichi, S.; Guadayol, J.M.; Caixach, J.; López-Tamames, E.; Buxaderas, S.,
Analytical, Nutritional, and Clinical Methods. Comparative study of different extraction techniques for the analysis of virgin olive oil aroma,
Food Chem., 2007, 105, 3, 1171-1178, https://doi.org/10.1016/j.foodchem.2007.02.018
. [all data]
Viegas and Bassoli, 2007
Viegas, M.C.; Bassoli, D.G.,
Utilizacao do indice de retencao linear para caracterizacao de compostos volateis em cafe soluvel utilizando GC-MS e coluna HP-Innowax,
Quim. Nova, 2007, 30, 8, 2031-2034, https://doi.org/10.1590/S0100-40422007000800040
. [all data]
Zhang C., Zhang H., et al., 2007
Zhang C.; Zhang H.; Wang L.; Gao H.; Guo X.N.; Yao H.Y.,
Improvement of texture properties and flavor of frozen dough by carrot (Daucus carota) antifreeze protein supplementation,
J. Agric. Food Chem., 2007, 55, 23, 9620-9626, https://doi.org/10.1021/jf0717034
. [all data]
Editorial paper, 2005
Editorial paper,
Solid Phase Microextraction (SPME) Application Guide,
The Reporter Europe (Supelco), 2005, 16, 5, 12-12. [all data]
Jales, Maia, et al., 2005
Jales, K.A.; Maia, G.A.; Garruti, D.S.; Neto, M.A.S.; Janzantti, N.S.; Franco, M.R.B.,
Evaluation de los compuestos odoriferos del jugo de maracuya amarillo por GC-MS y GC-O (OSME),
Alimentis y bebidas, 2005, 3, 12-14. [all data]
Piasenzotto, Gracco, et al., 2003
Piasenzotto, L.; Gracco, L.; Conte, L.,
Solid phase microextraction (SPME) applied to honey quality control,
J. Sci. Food Agric., 2003, 83, 10, 1037-1044, https://doi.org/10.1002/jsfa.1502
. [all data]
Selli, Cabaroglu, et al., 2003
Selli, s.; Cabaroglu, T.; Canbas, A.,
Flavour components of orange wine made from a Turkish cv. Kozan,
Int. J. Food Sci. Technol., 2003, 38, 5, 587-593, https://doi.org/10.1046/j.1365-2621.2003.00691.x
. [all data]
Tasdemir, Demirci, et al., 2003
Tasdemir, D.; Demirci, B.; Demirci, F.; Dönmez, A.A.; Baser, K.H.C.; Rüedi, P.,
Analysis of the Volatile Components of Five Turkish Rhododendron Species by Headspace Solid-Phase Microextraction and GC-MS (HS-SPME-GC-MS),
Z. Naturforsch., 2003, 58c, 797-803. [all data]
López and Dufour, 2001
López, M.G.; Dufour, J.P.,
Chapter 6. Tequilas: charm analysis of Blanco, Teposado, and Anejo tequilas,
Am. Chem. Soc. Symp. Ser., 2001, 782, 62-72. [all data]
Mayorga, Knapp, et al., 2001
Mayorga, H.; Knapp, H.; Winterhalter, P.; Duque, C.,
Glycosidically bound flavor compounds of cape gooseberry (Physalis peruviana L.),
J. Agric. Food Chem., 2001, 49, 4, 1904-1908, https://doi.org/10.1021/jf0011743
. [all data]
Rogerson, Castro, et al., 2001
Rogerson, F.S.S.; Castro, H.; Fortunato, N.; Azevedo, Z.; Macedo, A.; de Freitas, V.A.P.,
Chemicals with sweet aroma descriptors found in Portuguese wines from the Douro region: 2,6,6-trimethylcyclohex-2-ene-1,4-dione and diacetyl,
J. Agric. Food Chem., 2001, 49, 1, 263-269, https://doi.org/10.1021/jf000948c
. [all data]
Saglam, Gozler, et al., 2001
Saglam, H.; Gozler, T.; Kivcak, B.; Demirci, B.; Baser, K.H.C.,
Volatile compounds from Haplophyllum myrtifolium,
Chem. Nat. Compd. (Engl. Transl.), 2001, 37, 5, 442-444, https://doi.org/10.1023/A:1014467225815
. [all data]
Lambert, Demazeau, et al., 1999
Lambert, Y.; Demazeau, G.; Largeteau, A.; Bouvier, J.-M.,
Changes in aromatic volatile composition of strawberry after high pressure treatment,
Food Chem., 1999, 67, 1, 7-16, https://doi.org/10.1016/S0308-8146(99)00084-9
. [all data]
Vas, Gal, et al., 1998
Vas, G.; Gal, L.; Harangi, J.; Dobo, A.; Vekey, K.,
Determination of volatile aroma compounds of Blaeufrankisch wines extracted by solid-phase microextraction,
J. Chromatogr. Sci., 1998, 36, 10, 505-510, https://doi.org/10.1093/chromsci/36.10.505
. [all data]
Ziegleder, 1998
Ziegleder, G.,
Volatile and odorous compounds in unprinted paperboard,
Packag. Technol. Sci., 1998, 11, 5, 231-239, https://doi.org/10.1002/(SICI)1099-1522(1998090)11:5<231::AID-PTS437>3.0.CO;2-A
. [all data]
López-Tamames, Carro-Mariño, et al., 1997
López-Tamames, E.; Carro-Mariño, N.; Gunata, Y.Z.; Sapis, C.; Baumes, R.; Bayonove, C.,
Potential aroma in several varieties of Spanish grapes,
J. Agric. Food Chem., 1997, 45, 5, 1729-1735, https://doi.org/10.1021/jf960572w
. [all data]
Carro Marino, López Tamames, et al., 1995
Carro Marino, N.; López Tamames, E.; García Jares, C.M.,
Contribution to the study of the aromatic potential of three muscat Vitis vinifera varieties: identification of new compounds,
Food Sci. Technol. Int., 1995, 1, 2-3, 105-116, https://doi.org/10.1177/108201329500100206
. [all data]
Marlatt, Ho, et al., 1992
Marlatt, C.; Ho, C.-T.; Chien, M.,
Studies of aroma constituents bound as glycosides in tomato,
J. Agric. Food Chem., 1992, 40, 2, 249-252, https://doi.org/10.1021/jf00014a016
. [all data]
Miranda-Lopez, Libbey, et al., 1992
Miranda-Lopez, R.; Libbey, L.M.; Watson, B.T.; McDaniel, M.R.,
Odor analysis of Pinot noir wines from grapes of different maturities by a gas chromatography-olfactometry technique (Osme),
J. Food Sci., 1992, 57, 4, 985-993, https://doi.org/10.1111/j.1365-2621.1992.tb14339.x
. [all data]
Peng, Yang, et al., 1991
Peng, C.T.; Yang, Z.C.; Ding, S.F.,
Prediction of rentention idexes. II. Structure-retention index relationship on polar columns,
J. Chromatogr., 1991, 586, 1, 85-112, https://doi.org/10.1016/0021-9673(91)80028-F
. [all data]
MacLeod and Pieris, 1981
MacLeod, A.J.; Pieris, N.M.,
Volatile flavor components of beli fruit (Aegle marmelos) and a processed product,
J. Agric. Food Chem., 1981, 29, 6, 1262-1264, https://doi.org/10.1021/jf00108a040
. [all data]
Donnelly, Abdel-Hamid, et al., 1993
Donnelly, J.R.; Abdel-Hamid, M.S.; Jeter, J.L.; Gurka, D.F.,
Application of gas chromatographic retention properties to the identification of environmental contaminants,
J. Chromatogr., 1993, 642, 1-2, 409-415, https://doi.org/10.1016/0021-9673(93)80106-I
. [all data]