sec-butylammonium chloride
- Formula: C4H12ClN
- Molecular weight: 109.598
- IUPAC Standard InChIKey: VBPUICBFVUTJSE-UHFFFAOYSA-N
- CAS Registry Number: 10049-60-2
- Chemical structure:
View 3d structure (requires JavaScript / HTML 5) - Other names: 2-butanamine, hydrochloride

Phase change data

Data compiled by: Thermodynamics Research Center, NIST Boulder Laboratories, Chris Muzny director
Quantity | Value | Units | Method | Reference | Comment |
---|---|---|---|---|---|
Tfus | 422.59 | K | N/A | Donnelly, Drewes, et al., 1990 | Uncertainty assigned by TRC = 0.2 K |

References

Donnelly, Drewes, et al., 1990
Donnelly, J.R.; Drewes, L.A.; Johnson, R.L.; Munslow, W.D.; Knapp, K.K.; Sovocool, G.W.,
Purity and heat of fusion data for environmental standards as determined by differential scanning calorimetry,
Thermochim. Acta, 1990, 167, 2, 155, https://doi.org/10.1016/0040-6031(90)80476-F
. [all data]