Chlorine dioxide
- Formula: ClO2
- Molecular weight: 67.452
- IUPAC Standard InChIKey: OSVXSBDYLRYLIG-UHFFFAOYSA-N
- CAS Registry Number: 10049-04-4
- Chemical structure:
View 3d structure (requires JavaScript / HTML 5) - Other names: Chlorine oxide (ClO2); Chlorine(IV) oxide; Chloryl radical; Doxcide 50; Chlorine oxide; ClO2; Alcide; Anthium dioxcide; Chlorine peroxide; Chloroperoxyl

Gas phase thermochemistry data

Quantity | Value | Units | Method | Reference | Comment |
---|---|---|---|---|---|
ΔfH°gas | 104.60 | kJ/mol | Review | Chase, 1998 | Data last reviewed in December, 1992 |
Quantity | Value | Units | Method | Reference | Comment |
S°gas,1 bar | 257.22 | J/mol*K | Review | Chase, 1998 | Data last reviewed in December, 1992 |
Gas Phase Heat Capacity (Shomate Equation)
Cp° = A + B*t + C*t2 + D*t3 +
E/t2
H° − H°298.15= A*t + B*t2/2 +
C*t3/3 + D*t4/4 − E/t + F − H
S° = A*ln(t) + B*t + C*t2/2 + D*t3/3 −
E/(2*t2) + G
Cp = heat capacity (J/mol*K)
H° = standard enthalpy (kJ/mol)
S° = standard entropy (J/mol*K)
t = temperature (K) / 1000.
View plot Requires a JavaScript / HTML 5 canvas capable browser.
Temperature (K) | 298. to 1000. | 1000. to 6000. |
---|---|---|
A | 24.12473 | 57.43293 |
B | 81.01898 | 1.212997 |
C | -73.80702 | -0.106451 |
D | 24.54401 | 0.007852 |
E | -0.033548 | -2.773703 |
F | 94.29481 | 79.71022 |
G | 265.1367 | 314.8933 |
H | 104.6000 | 104.6000 |
Reference | Chase, 1998 | Chase, 1998 |
Comment | Data last reviewed in December, 1992 | Data last reviewed in December, 1992 |

Phase change data

Antoine Equation Parameters
log10(P) = A − (B / (T + C))
P = vapor pressure (bar)
T = temperature (K)
View plot Requires a JavaScript / HTML 5 canvas capable browser.
Temperature (K) | A | B | C | Reference | Comment |
---|---|---|---|---|---|
214. to 284.3 | 3.33293 | 644.581 | -90.46 | Stull, 1947 | Coefficents calculated by NIST from author's data. |

Henry's Law data

Data compiled by: Rolf Sander
Henry's Law constant (water solution)
kH(T) = k°H exp(d(ln(kH))/d(1/T) ((1/T) - 1/(298.15 K)))
k°H = Henry's law constant for solubility in water at 298.15 K (mol/(kg*bar))
d(ln(kH))/d(1/T) = Temperature dependence constant (K)
k°H (mol/(kg*bar)) | d(ln(kH))/d(1/T) (K) | Method | Reference | Comment |
---|---|---|---|---|
1.0 | 3300. | L | N/A | The parameterization given by missing citation (parameters A, B, C) doesn't fit the data in the same paper for this substance. Therefore the parameteriztaion of the solubility data (X1) was recalculated. |
0.84 | 3400. | X | N/A | |
1.0 | 3300. | L | N/A |

Gas phase ion energetics data

Data evaluated as indicated in comments:
L - Sharon G. Lias
Data compiled as indicated in comments:
LL - Sharon G. Lias and Joel F. Liebman
LLK - Sharon G. Lias, Rhoda D. Levin, and Sherif A. Kafafi
RDSH - Henry M. Rosenstock, Keith Draxl, Bruce W. Steiner, and John T. Herron
Quantity | Value | Units | Method | Reference | Comment |
---|---|---|---|---|---|
IE (evaluated) | 10.33 ± 0.02 | eV | N/A | N/A | L |
Ionization energy determinations
IE (eV) | Method | Reference | Comment |
---|---|---|---|
10.33 ± 0.02 | PI | Flesch, Ruhl, et al., 1993 | LL |
10.345 ± 0.005 | PE | Flesch, Ruhl, et al., 1993 | LL |
10.52 ± 0.06 | EI | Alekseev, Zyubina, et al., 1989 | LL |
10.77 ± 0.10 | EI | Baluev, Nikitina, et al., 1980 | LLK |
10.36 ± 0.02 | PE | Cornford, Frost, et al., 1971 | LLK |
10.7 ± 0.1 | EI | Fisher, 1967 | RDSH |
10.5 ± 0.1 | PE | Cornford, Frost, et al., 1972 | Vertical value; LLK |
Appearance energy determinations
Ion | AE (eV) | Other Products | Method | Reference | Comment |
---|---|---|---|---|---|
ClO+ | 13.45 ± 0.04 | O | PI | Flesch, Ruhl, et al., 1993 | LL |
ClO+ | 13.55 ± 0.08 | O | EI | Baluev, Nikitina, et al., 1980 | LLK |
ClO+ | 13.5 ± 0.1 | O | EI | Fisher, 1967 | RDSH |

References

Chase, 1998
Chase, M.W., Jr.,
NIST-JANAF Themochemical Tables, Fourth Edition,
J. Phys. Chem. Ref. Data, Monograph 9, 1998, 1-1951. [all data]
Stull, 1947
Stull, Daniel R.,
Vapor Pressure of Pure Substances. Organic and Inorganic Compounds,
Ind. Eng. Chem., 1947, 39, 4, 517-540, https://doi.org/10.1021/ie50448a022
. [all data]
Flesch, Ruhl, et al., 1993
Flesch, R.; Ruhl, E.; Hottmann, K.; Baumgartel, H.,
Photoabsorption and photoionization of chlorine dioxide,
J. Phys. Chem., 1993, 97, 837. [all data]
Alekseev, Zyubina, et al., 1989
Alekseev, V.I.; Zyubina, T.S.; Zyubin, A.S.; Baluev, A.V.,
Mass-spectrometric and quantum-chemical investigation of thermochemical characteristics of chlorine oxides,
J. Am. Chem. Soc., 1989, 2092. [all data]
Baluev, Nikitina, et al., 1980
Baluev, A.V.; Nikitina, Z.K.; Fedorova, L.I.; Rosolovskii, V.Ya.,
Mass spectrometric investigation of electron-impact induced ionization of chlorine dioxide and chloryl fluoride molecules,
Izv. Akad. Nauk SSSR, Ser. Khim., 1980, 1963. [all data]
Cornford, Frost, et al., 1971
Cornford, A.B.; Frost, D.C.; Herring, F.G.; McDowell, C.A.,
The photoelectron spectrum of the free radical chlorine dioxide,
Chem. Phys. Lett., 1971, 10, 345. [all data]
Fisher, 1967
Fisher, I.P.,
Mass spectrometry study of intermediates in thermal decomposition of perchloric acid and chlorine dioxide,
J. Chem. Soc. Faraday Trans., 1967, 63, 684. [all data]
Cornford, Frost, et al., 1972
Cornford, A.B.; Frost, D.C.; Herring, F.G.; McDowell, C.A.,
Photoelectron spectra of some free radicals,
Faraday Discuss. Chem. Soc., 1972, 54, 56. [all data]