4-Pyridinecarbonitrile
- Formula: C6H4N2
- Molecular weight: 104.1094
- IUPAC Standard InChIKey: GPHQHTOMRSGBNZ-UHFFFAOYSA-N
- CAS Registry Number: 100-48-1
- Chemical structure:
View 3d structure (requires JavaScript / HTML 5) - Other names: Isonicotinonitrile; γ-Cyanopyridine; Isonicotinic acid nitrile; 4-Cyanopyridine; 4-Pyridinenitrile

Gas phase thermochemistry data

Data compiled by: Hussein Y. Afeefy, Joel F. Liebman, and Stephen E. Stein
Quantity | Value | Units | Method | Reference | Comment |
---|---|---|---|---|---|
ΔfH°gas | 283.5 ± 1.1 | kJ/mol | Ccb | Bickerton, Pilcher, et al., 1984 |

Condensed phase thermochemistry data

Data compiled by: Hussein Y. Afeefy, Joel F. Liebman, and Stephen E. Stein
Quantity | Value | Units | Method | Reference | Comment |
---|---|---|---|---|---|
ΔfH°solid | 210.3 ± 0.9 | kJ/mol | Ccb | Bickerton, Pilcher, et al., 1984 | |
Quantity | Value | Units | Method | Reference | Comment |
ΔcH°solid | -3143.0 ± 0.5 | kJ/mol | Ccb | Bickerton, Pilcher, et al., 1984 |

Phase change data

Data compiled as indicated in comments:
BS - Robert L. Brown and Stephen E. Stein
TRC - Thermodynamics Research Center, NIST Boulder Laboratories, Chris Muzny director
ALS - Hussein Y. Afeefy, Joel F. Liebman, and Stephen E. Stein
DRB - Donald R. Burgess, Jr.
AC - William E. Acree, Jr., James S. Chickos
Quantity | Value | Units | Method | Reference | Comment |
---|---|---|---|---|---|
Tboil | 351. to 353. | K | N/A | Frinton Laboratories Inc., 1986 | BS |
Quantity | Value | Units | Method | Reference | Comment |
Tfus | 352.4 | K | N/A | Leis and Curran, 1945 | Uncertainty assigned by TRC = 1. K; TRC |
Quantity | Value | Units | Method | Reference | Comment |
ΔsubH° | 73.2 ± 0.6 | kJ/mol | C | Bickerton, Pilcher, et al., 1984 | ALS |
ΔsubH° | 73.2 | kJ/mol | N/A | Bickerton, Pilcher, et al., 1984 | DRB |
ΔsubH° | 73.2 ± 0.6 | kJ/mol | C | Bickerton, Pilcher, et al., 1984 | AC |

Gas phase ion energetics data

Data evaluated as indicated in comments:
HL - Edward P. Hunter and Sharon G. Lias
Data compiled as indicated in comments:
LLK - Sharon G. Lias, Rhoda D. Levin, and Sherif A. Kafafi
Quantity | Value | Units | Method | Reference | Comment |
---|---|---|---|---|---|
Proton affinity (review) | 880.6 | kJ/mol | N/A | Hunter and Lias, 1998 | HL |
Quantity | Value | Units | Method | Reference | Comment |
Gas basicity | 848.8 | kJ/mol | N/A | Hunter and Lias, 1998 | HL |
Ionization energy determinations
IE (eV) | Method | Reference | Comment |
---|---|---|---|
10.4 ± 0.1 | EI | Stefanovic and Grutzmacher, 1974 | LLK |
10.7 | PE | Ramsey and Walker, 1974 | Vertical value; LLK |
10.30 | PE | Kobayashi and Nagakura, 1974 | Vertical value; LLK |

Kovats' RI, non-polar column, isothermal

Column type | Active phase | Temperature (C) | I | Reference | Comment |
---|---|---|---|---|---|
Packed | OV-101 | 130. | 955. | Osmialowski, Halkiewicz, et al., 1985 | Ar, Chromosorb W HP; Column length: 1. m |

Van Den Dool and Kratz RI, non-polar column, temperature ramp

Column type | Active phase | I | Reference | Comment |
---|---|---|---|---|
Capillary | DB-5 | 978. | Premecz and Ford, 1987 | He, 60. C @ 10. min, 10. K/min, 280. C @ 3. min; Column length: 30. m; Column diameter: 0.32 mm |

Van Den Dool and Kratz RI, polar column, temperature ramp

Column type | Active phase | I | Reference | Comment |
---|---|---|---|---|
Capillary | CAM | 1665. | Premecz and Ford, 1987 | He, 60. C @ 5. min, 5. K/min, 240. C @ 21. min; Column length: 15. m; Column diameter: 0.24 mm |

Normal alkane RI, non-polar column, isothermal

Column type | Active phase | Temperature (C) | I | Reference | Comment |
---|---|---|---|---|---|
Capillary | OV-101 | 130. | 955. | Qi, Yang, et al., 2000 |

References

Bickerton, Pilcher, et al., 1984
Bickerton, J.; Pilcher, G.; Al-Takhin, G.,
Enthalpies of combustion of the three aminopyridines and the three cyanopyridines,
J. Chem. Thermodyn., 1984, 16, 373-378. [all data]
Frinton Laboratories Inc., 1986
Frinton Laboratories Inc.,
Catalog Number 11, Frinton Laboratories Inc., Vineland, NJ, 1986, 99. [all data]
Leis and Curran, 1945
Leis, D.G.; Curran, B.C.,
Electric moments of some gamma-substituted pyridines,
J. Am. Chem. Soc., 1945, 67, 79. [all data]
Hunter and Lias, 1998
Hunter, E.P.; Lias, S.G.,
Evaluated Gas Phase Basicities and Proton Affinities of Molecules: An Update,
J. Phys. Chem. Ref. Data, 1998, 27, 3, 413-656, https://doi.org/10.1063/1.556018
. [all data]
Stefanovic and Grutzmacher, 1974
Stefanovic, D.; Grutzmacher, H.F.,
The ionisation potential of some substituted pyridines,
Org. Mass Spectrom., 1974, 9, 1052. [all data]
Ramsey and Walker, 1974
Ramsey, B.G.; Walker, F.A.,
A linear relationship between substituted pyridine lone pair vertical ionization potentials and pKa,
J. Am. Chem. Soc., 1974, 96, 3314. [all data]
Kobayashi and Nagakura, 1974
Kobayashi, T.; Nagakura, S.,
Photoelectron spectra of aminopyridines and cyanopyridines,
J. Electron Spectrosc. Relat. Phenom., 1974, 4, 207. [all data]
Perkampus and Braunschweig, 1967
Perkampus, H.-H.; Braunschweig, T.H.,
UV atlas of organic compounds, 1967, 3, G5/12. [all data]
Osmialowski, Halkiewicz, et al., 1985
Osmialowski, K.; Halkiewicz, J.; Radecki, A.; Kaliszan, R.,
Quantum chemical parameters in correlation analysis of gas-liquid chromatographic retention indices of amines,
J. Chromatogr., 1985, 346, 53-60, https://doi.org/10.1016/S0021-9673(00)90493-X
. [all data]
Premecz and Ford, 1987
Premecz, J.E.; Ford, M.E.,
Gas chromatographic separation of substituted pyridines,
J. Chromatogr., 1987, 388, 23-35, https://doi.org/10.1016/S0021-9673(01)94463-2
. [all data]
Qi, Yang, et al., 2000
Qi, Y.; Yang, J.; Xu, L.,
correlation analysis of the structures and gas liquid chromatographic retention indices of amines,
Chin. J. Anal. Chem., 2000, 28, 2, 223-227. [all data]