Benzylamine
- Formula: C7H9N
- Molecular weight: 107.1531
- IUPAC Standard InChIKey: WGQKYBSKWIADBV-UHFFFAOYSA-N
- CAS Registry Number: 100-46-9
- Chemical structure:
View 3d structure (requires JavaScript / HTML 5) - Other names: Benzenemethanamine; α-Aminotoluene; ω-Aminotoluene; (Phenylmethyl)amine; Monobenzylamine; N-Benzylamine; Sumine 2005; (Aminomethyl)benzene; NSC 8046; Phenylmethanamine; 857483-23-9; 858831-93-3

Gas phase thermochemistry data

Data compiled as indicated in comments:
ALS - Hussein Y. Afeefy, Joel F. Liebman, and Stephen E. Stein
DRB - Donald R. Burgess, Jr.
Quantity | Value | Units | Method | Reference | Comment |
---|---|---|---|---|---|
ΔfH°gas | 87.8 ± 2.7 | kJ/mol | Ccb | Carson, Laye, et al., 1977 | ALS |
ΔfH°gas | 56.6 | kJ/mol | N/A | Lemoult, 1907 | Value computed using ΔfHliquid° value of 3.0 kj/mol from Lemoult, 1907 and ΔvapH° value of 53.6 kj/mol from Carson, Laye, et al., 1977.; DRB |

Condensed phase thermochemistry data

Data compiled as indicated in comments:
ALS - Hussein Y. Afeefy, Joel F. Liebman, and Stephen E. Stein
DH - Eugene S. Domalski and Elizabeth D. Hearing
Quantity | Value | Units | Method | Reference | Comment |
---|---|---|---|---|---|
ΔfH°liquid | 34.2 ± 1.7 | kJ/mol | Ccb | Carson, Laye, et al., 1977 | ALS |
ΔfH°liquid | 3. | kJ/mol | Ccb | Lemoult, 1907 | ALS |
Quantity | Value | Units | Method | Reference | Comment |
ΔcH°liquid | -4075.0 ± 1.7 | kJ/mol | Ccb | Carson, Laye, et al., 1977 | ALS |
ΔcH°liquid | -4058. | kJ/mol | Ccb | Lemoult, 1907 | ALS |
Constant pressure heat capacity of liquid
Cp,liquid (J/mol*K) | Temperature (K) | Reference | Comment |
---|---|---|---|
207.18 | 298.15 | Nichols and Wads, 1975 | DH |

Phase change data

Data compiled as indicated in comments:
BS - Robert L. Brown and Stephen E. Stein
TRC - Thermodynamics Research Center, NIST Boulder Laboratories, Chris Muzny director
AC - William E. Acree, Jr., James S. Chickos
ALS - Hussein Y. Afeefy, Joel F. Liebman, and Stephen E. Stein
DRB - Donald R. Burgess, Jr.
Quantity | Value | Units | Method | Reference | Comment |
---|---|---|---|---|---|
Tboil | 440. ± 70. | K | AVG | N/A | Average of 6 values; Individual data points |
Quantity | Value | Units | Method | Reference | Comment |
ΔvapH° | 60.16 | kJ/mol | N/A | Majer and Svoboda, 1985 | |
ΔvapH° | 54.6 ± 0.3 | kJ/mol | N/A | Mokbel, Razzouk, et al., 2009 | Based on data from 293. to 362. K.; AC |
ΔvapH° | 54. ± 2. | kJ/mol | V | Carson, Laye, et al., 1977 | ALS |
ΔvapH° | 53.6 | kJ/mol | N/A | Carson, Laye, et al., 1977 | DRB |
Reduced pressure boiling point
Tboil (K) | Pressure (bar) | Reference | Comment |
---|---|---|---|
363.2 | 0.016 | Weast and Grasselli, 1989 | BS |
363. | 0.016 | Buckingham and Donaghy, 1982 | BS |
Enthalpy of vaporization
ΔvapH (kJ/mol) | Temperature (K) | Method | Reference | Comment |
---|---|---|---|---|
52.7 ± 0.3 | 328. | N/A | Mokbel, Razzouk, et al., 2009 | Based on data from 293. to 362. K.; AC |
51.8 | 317. | A | Stephenson and Malanowski, 1987 | Based on data from 302. to 458. K. See also Carson, Laye, et al., 1977 and Beersmans and Jungers, 2010.; AC |
Antoine Equation Parameters
log10(P) = A − (B / (T + C))
P = vapor pressure (bar)
T = temperature (K)
View plot Requires a JavaScript / HTML 5 canvas capable browser.
Temperature (K) | A | B | C | Reference | Comment |
---|---|---|---|---|---|
302. to 457.7 | 4.8271 | 2003.528 | -41.973 | Stull, 1947 | Coefficents calculated by NIST from author's data. |

Gas phase ion energetics data

Data evaluated as indicated in comments:
HL - Edward P. Hunter and Sharon G. Lias
Data compiled as indicated in comments:
MM - Michael M. Meot-Ner (Mautner)
LBLHLM - Sharon G. Lias, John E. Bartmess, Joel F. Liebman, John L. Holmes, Rhoda D. Levin, and W. Gary Mallard
LLK - Sharon G. Lias, Rhoda D. Levin, and Sherif A. Kafafi
RDSH - Henry M. Rosenstock, Keith Draxl, Bruce W. Steiner, and John T. Herron
LL - Sharon G. Lias and Joel F. Liebman
Quantity | Value | Units | Method | Reference | Comment |
---|---|---|---|---|---|
Proton affinity (review) | 913.3 | kJ/mol | N/A | Hunter and Lias, 1998 | HL |
Quantity | Value | Units | Method | Reference | Comment |
Gas basicity | 879.4 | kJ/mol | N/A | Hunter and Lias, 1998 | HL |
Proton affinity at 298K
Proton affinity (kJ/mol) | Reference | Comment |
---|---|---|
922.7 ± 7.8 | Wind, Papp, et al., 2005 | T = 298K; MM |
924. ± 4. | Cao and Holmes, 2000 | Authors recommend revision of Hunter and Lias, 1998 value based on their KM results, while results for other alkylamines are consistent with the Hunter and Lias, 1998 tabulated values.; MM |
Protonation entropy at 298K
Protonation entropy (J/mol*K) | Reference | Comment |
---|---|---|
-3. ± 10. | Wind, Papp, et al., 2005 | T = 298K; MM |
Ionization energy determinations
IE (eV) | Method | Reference | Comment |
---|---|---|---|
8.49 ± 0.06 | EI | Selim, Rabbih, et al., 1987 | LBLHLM |
8.8 | PE | Aue and Bowers, 1979 | LLK |
8.73 | PE | Bodor, Dewar, et al., 1970 | RDSH |
8.64 ± 0.05 | PI | Vilesov and Terenin, 1957 | RDSH |
9.46 | PE | Deshmukh, Dutta, et al., 1982 | Vertical value; LBLHLM |
9.10 ± 0.01 | PE | Debies and Rabalais, 1974 | Vertical value; LLK |
Appearance energy determinations
Ion | AE (eV) | Other Products | Method | Reference | Comment |
---|---|---|---|---|---|
CH4N+ | 10.08 ± 0.05 | C6H5 | EI | Holmes and Lossing, 1984 | LBLHLM |
C5H3+ | 17.68 ± 0.13 | NH+C2H5 | EI | Selim, Rabbih, et al., 1989 | LL |
C5H3+ | 17.23 ± 0.11 | NH2+H2+C2H2 | EI | Selim, Rabbih, et al., 1989 | LL |
C5H3+ | 16. ± 0. | NH2+C2H4 | EI | Selim, Rabbih, et al., 1989 | LL |
C6H6+ | 10.29 ± 0.05 | ? | EI | Selim, Rabbih, et al., 1992 | LL |
C6H7+ | 12.17 ± 0.06 | HCN | EI | Selim, Rabbih, et al., 1987, 2 | LBLHLM |
C7H6+ | 12.06 ± 0.10 | NH3 | EI | Selim, Rabbih, et al., 1987, 3 | LBLHLM |
C7H7+ | 11.75 ± 0.06 | NH2 | EI | Selim, Rabbih, et al., 1987, 2 | LBLHLM |
C7H7N+ | 9.35 ± 0.07 | H2 | PI | Akopyan, Vilesov, et al., 1962 | RDSH |
C7H8N+ | 9.25 ± 0.06 | H | EI | Selim, Rabbih, et al., 1987 | LBLHLM |
C7H8N+ | 9.3 ± 0.1 | H | PI | Akopyan and Vilesov, 1964 | RDSH |
C7H8N+ | 9.21 ± 0.07 | H | PI | Akopyan, Vilesov, et al., 1962 | RDSH |

Kovats' RI, non-polar column, isothermal

Column type | Active phase | Temperature (C) | I | Reference | Comment |
---|---|---|---|---|---|
Packed | SE-30 | 180. | 1035. | Oszczapowicz, Osek, et al., 1985 | N2, Chromosorb A AW; Column length: 3. m |
Packed | SE-30 | 180. | 1035. | Oszczapowicz, Osek, et al., 1984 | N2, Chromosorb W AW; Column length: 3. m |

Van Den Dool and Kratz RI, non-polar column, temperature ramp

Column type | Active phase | I | Reference | Comment |
---|---|---|---|---|
Capillary | OV-1 | 983.9 | Gautzsch and Zinn, 1996 | 8. K/min; Tstart: 35. C; Tend: 300. C |

Van Den Dool and Kratz RI, non-polar column, custom temperature program

Column type | Active phase | I | Reference | Comment |
---|---|---|---|---|
Capillary | HP-5MS | 1019.2 | Andriamaharavo, 2014 | 30. m/0.25 mm/0.25 μm, He; Program: 60C (1 min) => 5 C/min => 210C => 10 C/min => 280C (15 min) |

Van Den Dool and Kratz RI, polar column, temperature ramp

Column type | Active phase | I | Reference | Comment |
---|---|---|---|---|
Capillary | DB-Wax | 1307. | Shimoda, Peralta, et al., 1996 | 60. m/0.25 mm/0.25 μm, He, 3. K/min; Tstart: 50. C; Tend: 230. C |

Normal alkane RI, non-polar column, custom temperature program

Column type | Active phase | I | Reference | Comment |
---|---|---|---|---|
Capillary | Polydimethyl siloxanes | 994. | Zenkevich and Chupalov, 1996 | Program: not specified |
Other | Methyl Silicone | 995. | Ardrey and Moffat, 1981 | Program: not specified |

References

Carson, Laye, et al., 1977
Carson, A.S.; Laye, P.G.; Yrekli, M.,
The enthalpy of formation of benzylamine,
J. Chem. Thermodyn., 1977, 9, 827-829. [all data]
Lemoult, 1907
Lemoult, M.P.,
Recherches theoriques et experimentales sur les chaleurs de combustion et de formation des composes organiques,
Ann. Chim. Phys., 1907, 12, 395-432. [all data]
Nichols and Wads, 1975
Nichols, N.; Wads, I.,
Thermochemistry of solutions of biochemical model compounds. 3. Some benzene derivatives in aqueous solution,
J. Chem. Thermodynam., 1975, 7, 329-336. [all data]
Majer and Svoboda, 1985
Majer, V.; Svoboda, V.,
Enthalpies of Vaporization of Organic Compounds: A Critical Review and Data Compilation, Blackwell Scientific Publications, Oxford, 1985, 300. [all data]
Mokbel, Razzouk, et al., 2009
Mokbel, Ilham; Razzouk, Antonio; Sawaya, Terufat; Jose, Jacques,
Experimental Vapor Pressures of 2-Phenylethylamine, Benzylamine, Triethylamine, and cis -2,6-Dimethylpiperidine in the Range between 0.2 Pa and 75 kPa,
J. Chem. Eng. Data, 2009, 54, 3, 819-822, https://doi.org/10.1021/je800603z
. [all data]
Weast and Grasselli, 1989
CRC Handbook of Data on Organic Compounds, 2nd Editon, Weast,R.C and Grasselli, J.G., ed(s)., CRC Press, Inc., Boca Raton, FL, 1989, 1. [all data]
Buckingham and Donaghy, 1982
Buckingham, J.; Donaghy, S.M.,
Dictionary of Organic Compounds: Fifth Edition, Chapman and Hall, New York, 1982, 1. [all data]
Stephenson and Malanowski, 1987
Stephenson, Richard M.; Malanowski, Stanislaw,
Handbook of the Thermodynamics of Organic Compounds, 1987, https://doi.org/10.1007/978-94-009-3173-2
. [all data]
Beersmans and Jungers, 2010
Beersmans, J.; Jungers, J.C.,
Synthèse et Étude des Chlorure, Bromure et Iodure de Deutérométhyle,
Bull. Soc. Chim. Belges, 2010, 56, 5-8, 238-250, https://doi.org/10.1002/bscb.19470560506
. [all data]
Stull, 1947
Stull, Daniel R.,
Vapor Pressure of Pure Substances. Organic and Inorganic Compounds,
Ind. Eng. Chem., 1947, 39, 4, 517-540, https://doi.org/10.1021/ie50448a022
. [all data]
Hunter and Lias, 1998
Hunter, E.P.; Lias, S.G.,
Evaluated Gas Phase Basicities and Proton Affinities of Molecules: An Update,
J. Phys. Chem. Ref. Data, 1998, 27, 3, 413-656, https://doi.org/10.1063/1.556018
. [all data]
Wind, Papp, et al., 2005
Wind, J.J.; Papp, L.; Happel, M.; Hahn, K.; Andriole, E.J.; Poutsma, J.C.,
Proton Affinity of beta-Oxalylaminoalanine (BOAA): Incorporation of Direct Entropy Correction into the Single-Reference Kinetic Method,
J. Am. Soc. Mass Spectrom., 2005, 16, 1151. [all data]
Cao and Holmes, 2000
Cao, J.; Holmes, J.L.,
The proton affinity of amine-alkanes. A test case for the kinetic method,
Int. J. Mass Spectrom., 2000, 195/196, 525. [all data]
Selim, Rabbih, et al., 1987
Selim, E.T.; Rabbih, M.A.; Fahmey, M.A.,
M and [M-1]+ ions formed for benzyl alcohol, benzyl amine and benzyl cyanide,
Org. Mass Spectrom., 1987, 22, 381. [all data]
Aue and Bowers, 1979
Aue, D.H.; Bowers, M.T.,
Chapter 9. Stabilities of positive ions from equilibrium gas phase basicity measurements
in Ions Chemistry,, ed. M.T. Bowers, 1979. [all data]
Bodor, Dewar, et al., 1970
Bodor, N.; Dewar, M.J.S.; Jennings, W.B.; Worley, S.D.,
Photoelectron spectra of molecules-IV.Ionization potentials and heats of formation of some hydrazines and amines,
Tetrahedron, 1970, 26, 4109. [all data]
Vilesov and Terenin, 1957
Vilesov, F.I.; Terenin, A.N.,
The photoionization of the vapors of certain organic compounds,
Dokl. Akad. Nauk SSSR, 1957, 115, 744, In original 539. [all data]
Deshmukh, Dutta, et al., 1982
Deshmukh, P.; Dutta, T.K.; Hwang, J.L.-S.; Housecroft, C.E.; Fehlner, T.P.,
Photoelectron spectroscopic measurements of the relative charge on carbyne fragments bound to polynuclear cobalt carbonyl clusters,
J. Am. Chem. Soc., 1982, 104, 1740. [all data]
Debies and Rabalais, 1974
Debies, T.P.; Rabalais, J.W.,
Photoelectron spectra of substituted benzenes. III. Bonding with Group V substituents,
Inorg. Chem., 1974, 13, 308. [all data]
Holmes and Lossing, 1984
Holmes, J.L.; Lossing, F.P.,
Heats of formation of organic radicals from appearance energies,
Int. J. Mass Spectrom. Ion Processes, 1984, 58, 113. [all data]
Selim, Rabbih, et al., 1989
Selim, E.T.M.; Rabbih, M.A.; Fahmey Ahmad, M.A.; Shalbi, A.S.,
Energetic study of [C5H3]+ fragment ion produced from some benzyl derivatives,
Arab Gulf J. Sci. Res., 1989, 7, 53. [all data]
Selim, Rabbih, et al., 1992
Selim, E.T.M.; Rabbih, M.A.; Fahmey, M.A.; Hawash, M.F.,
Electron impact study of [C6H6]+ fragment ions produced from isomeric C7H9N precursors using the deconvoluted first differential technique and kinetic release measurements,
Int. J. Mass Spectrom. Ion Processes, 1992, 113, 133. [all data]
Selim, Rabbih, et al., 1987, 2
Selim, E.T.M.; Rabbih, M.A.; Fahmey, M.A.,
A mass spectrometric study of [C7H7]+ and [C6H7]+ fragment ions obtained from benzyl alcohol, benzyl amine and benzyl cyanide,
Egypt. J. Phys., 1987, 18, 37. [all data]
Selim, Rabbih, et al., 1987, 3
Selim, E.T.; Rabbih, M.A.; Rezk, A.M.H.; Fahmey, M.A.,
Energetics of [C7H6]+ fragment ion using electron impact technique,
Indian J. Pure Appl. Phys., 1987, 25, 451. [all data]
Akopyan, Vilesov, et al., 1962
Akopyan, M.E.; Vilesov, F.I.; Terenin, A.N.,
A mass-spectroscopic study of the spectral dependence of the efficiency of photoionization of benzene derivatives,
Dokl. Akad. Nauk SSSR 1961,140,1037 (Engl. Transl.: Soviet Phys. - Dokl., 1962, 6, 890). [all data]
Akopyan and Vilesov, 1964
Akopyan, M.E.; Vilesov, F.I.,
Excited states of positive ions and dissociative photoionization of aromatic amines,
Dokl. Akad. Nauk SSSR, 1964, 158, 1386, In original 965. [all data]