Benzyl chloride
- Formula: C7H7Cl
- Molecular weight: 126.583
- IUPAC Standard InChIKey: KCXMKQUNVWSEMD-UHFFFAOYSA-N
- CAS Registry Number: 100-44-7
- Chemical structure:
View 3d structure (requires JavaScript / HTML 5) - Other names: Benzene, (chloromethyl)-; Toluene, α-chloro-; α-Chlorotoluene; ω-Chlorotoluene; (Chloromethyl)benzene; Chlorophenylmethane; C6H5CH2Cl; α-Chlortoluol; Benzile (cloruro di); Benzylchlorid; Benzyle (chlorure de); Chlorure de benzyle; NCI-C06360; Rcra waste number P028; UN 1738; Phenylmethyl chloride; NSC 8043; Tolyl chloride

Gas phase thermochemistry data

Data compiled by: Hussein Y. Afeefy, Joel F. Liebman, and Stephen E. Stein
Quantity | Value | Units | Method | Reference | Comment |
---|---|---|---|---|---|
ΔfH°gas | 19. ± 3. | kJ/mol | Cm | Kirkbride, 1956 | heat of formation derived by Cox and Pilcher, 1970 |

Condensed phase thermochemistry data

Data compiled as indicated in comments:
ALS - Hussein Y. Afeefy, Joel F. Liebman, and Stephen E. Stein
DH - Eugene S. Domalski and Elizabeth D. Hearing
Quantity | Value | Units | Method | Reference | Comment |
---|---|---|---|---|---|
ΔfH°liquid | -33. ± 3. | kJ/mol | Cm | Kirkbride, 1956 | heat of formation derived by Cox and Pilcher, 1970; ALS |
Constant pressure heat capacity of liquid
Cp,liquid (J/mol*K) | Temperature (K) | Reference | Comment |
---|---|---|---|
182.4 | 298.5 | Smith and Andrews, 1931 | T = 102 to 299 K. Value is unsmoothed experimental datum.; DH |

Phase change data

Data compiled as indicated in comments:
BS - Robert L. Brown and Stephen E. Stein
TRC - Thermodynamics Research Center, NIST Boulder Laboratories, Chris Muzny director
AC - William E. Acree, Jr., James S. Chickos
ALS - Hussein Y. Afeefy, Joel F. Liebman, and Stephen E. Stein
Quantity | Value | Units | Method | Reference | Comment |
---|---|---|---|---|---|
Tboil | 452. ± 3. | K | AVG | N/A | Average of 8 values; Individual data points |
Quantity | Value | Units | Method | Reference | Comment |
Tfus | 233.95 | K | N/A | Timmermans and Hennaut-Roland, 1935 | Uncertainty assigned by TRC = 0.3 K; TRC |
Tfus | 233.45 | K | N/A | Smith and Andrews, 1931, 2 | Uncertainty assigned by TRC = 0.4 K; freezing point by thermocouple; TRC |
Tfus | 225.3 | K | N/A | Altschul and Von Schneider, 1895 | Uncertainty assigned by TRC = 0.5 K; TRC |
Quantity | Value | Units | Method | Reference | Comment |
ΔvapH° | 50.1 ± 0.3 | kJ/mol | GS | Krasnykh, Vasiltsova, et al., 2002 | Based on data from 276. to 309. K.; AC |
ΔvapH° | 49.9 | kJ/mol | CGC | Krasnykh, Vasiltsova, et al., 2002 | AC |
ΔvapH° | 50.1 ± 0.5 | kJ/mol | N/A | Ashcroft, 1976 | See also Dykyj, Svoboda, et al., 1999.; AC |
ΔvapH° | 51. ± 2. | kJ/mol | V | Kirkbride, 1956 | heat of formation derived by Cox and Pilcher, 1970; ALS |
Enthalpy of vaporization
ΔvapH (kJ/mol) | Temperature (K) | Method | Reference | Comment |
---|---|---|---|---|
48.6 | 335. | A,I | Stephenson and Malanowski, 1987 | Based on data from 320. to 390. K. See also Ashcroft, 1976.; AC |
48.6 | 310. | A | Stephenson and Malanowski, 1987 | Based on data from 295. to 453. K. See also Stull, 1947.; AC |
Antoine Equation Parameters
log10(P) = A − (B / (T + C))
P = vapor pressure (bar)
T = temperature (K)
View plot Requires a JavaScript / HTML 5 canvas capable browser.
Temperature (K) | A | B | C | Reference | Comment |
---|---|---|---|---|---|
295. to 452.6 | 4.68263 | 1932.142 | -39.396 | Stull, 1947 | Coefficents calculated by NIST from author's data. |
Enthalpy of fusion
ΔfusH (kJ/mol) | Temperature (K) | Method | Reference | Comment |
---|---|---|---|---|
8.74 | 230. | DSC | Ahmed and Eades, 1972 | AC |

Gas phase ion energetics data

Data compiled as indicated in comments:
B - John E. Bartmess
LL - Sharon G. Lias and Joel F. Liebman
LLK - Sharon G. Lias, Rhoda D. Levin, and Sherif A. Kafafi
RDSH - Henry M. Rosenstock, Keith Draxl, Bruce W. Steiner, and John T. Herron
Ionization energy determinations
IE (eV) | Method | Reference | Comment |
---|---|---|---|
9.10 ± 0.02 | PI | Traeger and Kompe, 1990 | LL |
9.14 ± 0.01 | PI | Ponomarev, Takhimova, et al., 1974 | LLK |
9.14 ± 0.01 | PI | Akopyan, Vilesov, et al., 1972 | LLK |
9.10 ± 0.05 | PI | Akopyan and Vilesov, 1966 | RDSH |
9.30 | PE | Zverev and Ermolaeva, 1981 | Vertical value; LLK |
9.29 | PE | Kimura, Katsumata, et al., 1981 | Vertical value; LLK |
9.30 | PE | Schmidt and Schweig, 1973 | Vertical value; LLK |
Appearance energy determinations
Ion | AE (eV) | Other Products | Method | Reference | Comment |
---|---|---|---|---|---|
C7H7+ | 9.85 ± 0.02 | Cl | PI | Traeger and Kompe, 1990 | LL |
C7H7+ | 10.16 ± 0.05 | Cl | PI | Akopyan, Vilesov, et al., 1972 | LLK |
C7H7+ | 10.40 ± 0.05 | Cl | PI | Akopyan and Vilesov, 1966 | RDSH |
De-protonation reactions
C7H6Cl- + =
By formula: C7H6Cl- + H+ = C7H7Cl
Quantity | Value | Units | Method | Reference | Comment |
---|---|---|---|---|---|
ΔrH° | 1659. ± 6.7 | kJ/mol | Bran | Wenthold and Squires, 1995 | gas phase; By HO- cleavage of substituted silanes; B |
Quantity | Value | Units | Method | Reference | Comment |
ΔrG° | 1627. ± 7.1 | kJ/mol | H-TS | Wenthold and Squires, 1995 | gas phase; By HO- cleavage of substituted silanes; B |
C7H6Cl- + =
By formula: C7H6Cl- + H+ = C7H7Cl
Quantity | Value | Units | Method | Reference | Comment |
---|---|---|---|---|---|
ΔrH° | 1556. ± 8.8 | kJ/mol | G+TS | Poutsma, Nash, et al., 1997 | gas phase; B |
Quantity | Value | Units | Method | Reference | Comment |
ΔrG° | 1527. ± 8.4 | kJ/mol | IMRB | Poutsma, Nash, et al., 1997 | gas phase; B |

Henry's Law data

Data compiled by: Rolf Sander
Henry's Law constant (water solution)
kH(T) = k°H exp(d(ln(kH))/d(1/T) ((1/T) - 1/(298.15 K)))
k°H = Henry's law constant for solubility in water at 298.15 K (mol/(kg*bar))
d(ln(kH))/d(1/T) = Temperature dependence constant (K)
k°H (mol/(kg*bar)) | d(ln(kH))/d(1/T) (K) | Method | Reference |
---|---|---|---|
1.6 | L | N/A |

Reaction thermochemistry data

Data compiled by: John E. Bartmess
Individual Reactions
C7H6Cl- + =
By formula: C7H6Cl- + H+ = C7H7Cl
Quantity | Value | Units | Method | Reference | Comment |
---|---|---|---|---|---|
ΔrH° | 396.6 ± 1.6 | kcal/mol | Bran | Wenthold and Squires, 1995 | gas phase; By HO- cleavage of substituted silanes |
Quantity | Value | Units | Method | Reference | Comment |
ΔrG° | 388.8 ± 1.7 | kcal/mol | H-TS | Wenthold and Squires, 1995 | gas phase; By HO- cleavage of substituted silanes |
C7H6Cl- + =
By formula: C7H6Cl- + H+ = C7H7Cl
Quantity | Value | Units | Method | Reference | Comment |
---|---|---|---|---|---|
ΔrH° | 372.0 ± 2.1 | kcal/mol | G+TS | Poutsma, Nash, et al., 1997 | gas phase |
Quantity | Value | Units | Method | Reference | Comment |
ΔrG° | 364.9 ± 2.0 | kcal/mol | IMRB | Poutsma, Nash, et al., 1997 | gas phase |

Kovats' RI, non-polar column, isothermal

Column type | Active phase | Temperature (C) | I | Reference | Comment |
---|---|---|---|---|---|
Packed | SE-30 | 150. | 1015. | Tiess, 1984 | Ar, Gas Chrom Q (80-100 mesh); Column length: 3. m |

Van Den Dool and Kratz RI, non-polar column, temperature ramp

Column type | Active phase | I | Reference | Comment |
---|---|---|---|---|
Capillary | DB-1 | 977.9 | Sun and Stremple, 2003 | 30. m/0.25 mm/0.25 μm, He, 3. K/min; Tstart: 40. C; Tend: 325. C |
Capillary | DB-5 | 1023. | Dallüge, van Stee, et al., 2002 | 30. m/0.25 mm/1. μm, He, 2.5 K/min; Tstart: 50. C; Tend: 200. C |
Capillary | OV-1 | 985.6 | Gautzsch and Zinn, 1996 | 8. K/min; Tstart: 35. C; Tend: 300. C |
Capillary | DB-1 | 1002. | Gandhe, Malhotra, et al., 1989 | 30. m/0.32 mm/0.25 μm, N2, 60. C @ 2. min, 8. K/min; Tend: 200. C |

Normal alkane RI, non-polar column, temperature ramp

Column type | Active phase | I | Reference | Comment |
---|---|---|---|---|
Capillary | SE-30 | 1008. | Krasnykh, Vasiltsova, et al., 2002 | Nitrogen, 30. C @ 5. min, 10. K/min; Column length: 25. m; Tend: 250. C |
Capillary | OV-101 | 986. | Zenkevich, 2001 | N2, 4. K/min; Column length: 25. m; Column diameter: 0.20 mm; Tstart: 60. C; Tend: 240. C |
Capillary | BP-1 | 996. | Health Safety Executive, 2000 | 50. m/0.22 mm/0.75 μm, He, 5. K/min; Tstart: 50. C; Tend: 200. C |
Capillary | BP-1 | 997. | Health Safety Executive, 2000 | 50. m/0.22 mm/0.75 μm, He, 5. K/min; Tstart: 50. C; Tend: 200. C |

Normal alkane RI, non-polar column, custom temperature program

Column type | Active phase | I | Reference | Comment |
---|---|---|---|---|
Capillary | Polydimethyl siloxanes | 986. | Zenkevich, Eliseenkov, et al., 2006 | Program: not specified |
Capillary | Methyl Silicone | 986. | Zenkevich, 1999 | Program: not specified |
Capillary | Polydimethyl siloxanes | 986. | Zenkevich and Chupalov, 1996 | Program: not specified |
Capillary | Polydimethyl siloxanes | 986. | Zenkevich and Chupalov, 1996 | Program: not specified |
Capillary | OV-1 | 983. | Waggott and Davies, 1984 | Hydrogen; Column length: 50. m; Column diameter: 0.32 mm; Program: not specified |

Normal alkane RI, polar column, custom temperature program

Column type | Active phase | I | Reference | Comment |
---|---|---|---|---|
Capillary | Superox 0.6; Carbowax 20M | 1478. | Waggott and Davies, 1984 | Hydrogen; Column length: 50. m; Column diameter: 0.32 mm; Program: not specified |
Capillary | Superox 0.6; Carbowax 20M | 1497. | Waggott and Davies, 1984 | Hydrogen; Column length: 50. m; Column diameter: 0.32 mm; Program: not specified |
Capillary | Carbowax 400, Carbowax 20M, Carbowax 1540, Carbowax 4000, Superox 06, PEG 20M, etc. | 1478. | Waggott and Davies, 1984 | Hydrogen; Column length: 50. m; Column diameter: 0.32 mm; Program: not specified |

References

Kirkbride, 1956
Kirkbride, F.W.,
The heats of chlorination of some hydrocarbons and their chloro-derivatives,
J. Appl. Chem., 1956, 6, 11-21. [all data]
Cox and Pilcher, 1970
Cox, J.D.; Pilcher, G.,
Thermochemistry of Organic and Organometallic Compounds, Academic Press, New York, 1970, 1-636. [all data]
Smith and Andrews, 1931
Smith, R.H.; Andrews, D.H.,
Thermal energy studies. I. Phenyl derivatives of methane,
ethane and some related compounds. J. Am. Chem. Soc., 1931, 53, 3644-3660. [all data]
Timmermans and Hennaut-Roland, 1935
Timmermans, J.; Hennaut-Roland, M.,
Physical constants of 20 organic compounds. VII.,
J. Chim. Phys. Phys.-Chim. Biol., 1935, 32, 501. [all data]
Smith and Andrews, 1931, 2
Smith, R.H.; Andrews, D.H.,
Thermal Energy Studies I. Phenyl Derivatives of Methane, Ethane and Some Related Compounds,
J. Am. Chem. Soc., 1931, 53, 3644. [all data]
Altschul and Von Schneider, 1895
Altschul, M.; Von Schneider, B.,
Freezing points of some organic fluids,
Z. Phys. Chem., Stoechiom. Verwandtschaftsl., 1895, 16, 24. [all data]
Krasnykh, Vasiltsova, et al., 2002
Krasnykh, Eugen L.; Vasiltsova, Tatiana V.; Verevkin, Sergey P.; Heintz, Andreas,
Vapor Pressures and Enthalpies of Vaporization of Benzyl Halides and Benzyl Ethers,
J. Chem. Eng. Data, 2002, 47, 6, 1372-1378, https://doi.org/10.1021/je020034h
. [all data]
Ashcroft, 1976
Ashcroft, Stanley J.,
Vapor pressures and enthalpies of vaporization of benzyl halides,
J. Chem. Eng. Data, 1976, 21, 4, 397-398, https://doi.org/10.1021/je60071a009
. [all data]
Dykyj, Svoboda, et al., 1999
Dykyj, J.; Svoboda, J.; Wilhoit, R.C.; Frenkel, M.L.; Hall, K.R.,
Vapor Pressure of Chemicals: Part A. Vapor Pressure and Antoine Constants for Hydrocarbons and Sulfur, Selenium, Tellurium and Hydrogen Containing Organic Compounds, Springer, Berlin, 1999, 373. [all data]
Stephenson and Malanowski, 1987
Stephenson, Richard M.; Malanowski, Stanislaw,
Handbook of the Thermodynamics of Organic Compounds, 1987, https://doi.org/10.1007/978-94-009-3173-2
. [all data]
Stull, 1947
Stull, Daniel R.,
Vapor Pressure of Pure Substances. Organic and Inorganic Compounds,
Ind. Eng. Chem., 1947, 39, 4, 517-540, https://doi.org/10.1021/ie50448a022
. [all data]
Ahmed and Eades, 1972
Ahmed, A.M.I.; Eades, R.G.,
Proton magnetic relaxation in toluene and some derivatives,
J. Chem. Soc., Faraday Trans. 2, 1972, 68, 1623, https://doi.org/10.1039/f29726801623
. [all data]
Traeger and Kompe, 1990
Traeger, J.C.; Kompe, B.M.,
Threshold C7H7 formation from the benzyl halides by photoionization mass spectrometry,
Int. J. Mass Spectrom. Ion Processes, 1990, 101, 111. [all data]
Ponomarev, Takhimova, et al., 1974
Ponomarev, D.A.; Takhimova, V.V.; Akopyan, M.E.; Sergeyev, Y.L.,
Effect of alkyl groups on the stability of cations in the absence of solvation effects,
Zh. Org. Khim., 1974, 10, 403. [all data]
Akopyan, Vilesov, et al., 1972
Akopyan, M.E.; Vilesov, F.I.; Lopatin, S.N.,
Photoionization of benzyl chloride,
Khim. Vys. Energ., 1972, 6, 110. [all data]
Akopyan and Vilesov, 1966
Akopyan, M.E.; Vilesov, F.I.,
A mass-spectrometric study of the photo-ionisation of benzene derivatives at wavelengths up to 885 A,
Zh. Fiz. Khim., 1966, 40, 125, In original 63. [all data]
Zverev and Ermolaeva, 1981
Zverev, V.V.; Ermolaeva, L.V.,
Ionization potentials and intramolecular charge transfer. II. The photoelectron spectrum and electronic structure of trichloromethylbenzene,
Zh. Strukt. Khim., 1981, 22, 22. [all data]
Kimura, Katsumata, et al., 1981
Kimura, K.; Katsumata, S.; Achiba, Y.; Yamazaki, T.; Iwata, S.,
Ionization energies, Ab initio assignments, and valence electronic structure for 200 molecules
in Handbook of HeI Photoelectron Spectra of Fundamental Organic Compounds, Japan Scientific Soc. Press, Tokyo, 1981. [all data]
Schmidt and Schweig, 1973
Schmidt, H.; Schweig, A.,
C-Hal hyperkonjugation,
Tetrahedron Lett., 1973, 981. [all data]
Wenthold and Squires, 1995
Wenthold, P.G.; Squires, R.R.,
Determination of the gas-phase acidities of halogen-substituted aromatic compounds using the silane-cleavage method,
J. Mass Spectrom., 1995, 30, 1, 17, https://doi.org/10.1002/jms.1190300105
. [all data]
Poutsma, Nash, et al., 1997
Poutsma, J.C.; Nash, J.J.; Paulino, J.A.; Squires, R.R.,
Absolute Heats of Formation of Phenylcarbene and Vinylcarbene,
J. Am. Chem. Soc., 1997, 119, 20, 4686, https://doi.org/10.1021/ja963918s
. [all data]