4H-Pyran-4-one, 2,6-dimethyl-
- Formula: C7H8O2
- Molecular weight: 124.1372
- IUPAC Standard InChIKey: VSYFZULSKMFUJJ-UHFFFAOYSA-N
- CAS Registry Number: 1004-36-0
- Chemical structure:
View 3d structure (requires JavaScript / HTML 5) - Other names: 2,6-Dimethyl-γ-pyrone; 2,6-Dimethyl-4-pyranone; 2,6-Dimethyl-4-pyrone; 2,6-Dimethyl-4H-pyran-4-one; 2,6-Dimethyl-g-pyrone; 2,6-Dimethyl-pyran-4-one; γ-2,6-Dimethylpyrone

Phase change data

Data compiled by: Robert L. Brown and Stephen E. Stein
Quantity | Value | Units | Method | Reference | Comment |
---|---|---|---|---|---|
Tboil | 522.2 | K | N/A | Aldrich Chemical Company Inc., 1990 |

Gas phase ion energetics data

Data evaluated as indicated in comments:
HL - Edward P. Hunter and Sharon G. Lias
Data compiled as indicated in comments:
LBLHLM - Sharon G. Lias, John E. Bartmess, Joel F. Liebman, John L. Holmes, Rhoda D. Levin, and W. Gary Mallard
Quantity | Value | Units | Method | Reference | Comment |
---|---|---|---|---|---|
Proton affinity (review) | 941.5 | kJ/mol | N/A | Hunter and Lias, 1998 | HL |
Quantity | Value | Units | Method | Reference | Comment |
Gas basicity | 907.3 | kJ/mol | N/A | Hunter and Lias, 1998 | HL |
Ionization energy determinations
IE (eV) | Method | Reference | Comment |
---|---|---|---|
9.03 | EI | Grutzmacher and Spilker, 1985 | LBLHLM |
Appearance energy determinations
Ion | AE (eV) | Other Products | Method | Reference | Comment |
---|---|---|---|---|---|
C6H8O+ | 10.24 | CO | EI | Grutzmacher and Spilker, 1985 | LBLHLM |

References

Aldrich Chemical Company Inc., 1990
Aldrich Chemical Company Inc.,
Catalog Handbook of Fine Chemicals, Aldrich Chemical Company, Inc., Milwaukee WI, 1990, 1. [all data]
Hunter and Lias, 1998
Hunter, E.P.; Lias, S.G.,
Evaluated Gas Phase Basicities and Proton Affinities of Molecules: An Update,
J. Phys. Chem. Ref. Data, 1998, 27, 3, 413-656, https://doi.org/10.1063/1.556018
. [all data]
Grutzmacher and Spilker, 1985
Grutzmacher, H.-F.; Spilker, R.,
Loss of CO from 4,6-dimethyl-2-pyrone and 2,6-dimethyl-4-pyrone radical cations,
Org. Mass Spectrom., 1985, 20, 258. [all data]