calcium chloride
- Formula: CaCl2
- Molecular weight: 110.984
- CAS Registry Number: 10043-52-4

Gas phase thermochemistry data

Quantity | Value | Units | Method | Reference | Comment |
---|---|---|---|---|---|
ΔfH°gas | -471.54 | kJ/mol | Review | Chase, 1998 | Data last reviewed in June, 1970 |
Quantity | Value | Units | Method | Reference | Comment |
S°gas,1 bar | 290.26 | J/mol*K | Review | Chase, 1998 | Data last reviewed in June, 1970 |
Gas Phase Heat Capacity (Shomate Equation)
Cp° = A + B*t + C*t2 + D*t3 +
E/t2
H° − H°298.15= A*t + B*t2/2 +
C*t3/3 + D*t4/4 − E/t + F − H
S° = A*ln(t) + B*t + C*t2/2 + D*t3/3 −
E/(2*t2) + G
Cp = heat capacity (J/mol*K)
H° = standard enthalpy (kJ/mol)
S° = standard entropy (J/mol*K)
t = temperature (K) / 1000.
View plot Requires a JavaScript / HTML 5 canvas capable browser.
Temperature (K) | 3000. to 6000. |
---|---|
A | 62.17550 |
B | 0.155797 |
C | -0.042199 |
D | 0.003598 |
E | -0.260056 |
F | -490.9547 |
G | 363.9934 |
H | -471.5368 |
Reference | Chase, 1998 |
Comment | Data last reviewed in June, 1970 |

Condensed phase thermochemistry data

Quantity | Value | Units | Method | Reference | Comment |
---|---|---|---|---|---|
ΔfH°liquid | -774.09 | kJ/mol | Review | Chase, 1998 | Data last reviewed in June, 1970 |
Quantity | Value | Units | Method | Reference | Comment |
S°liquid,1 bar | 123.87 | J/mol*K | Review | Chase, 1998 | Data last reviewed in June, 1970 |
Quantity | Value | Units | Method | Reference | Comment |
ΔfH°solid | -795.80 | kJ/mol | Review | Chase, 1998 | Data last reviewed in June, 1970 |
Quantity | Value | Units | Method | Reference | Comment |
S°solid | 104.62 | J/mol*K | Review | Chase, 1998 | Data last reviewed in June, 1970 |
Liquid Phase Heat Capacity (Shomate Equation)
Cp° = A + B*t + C*t2 + D*t3 +
E/t2
H° − H°298.15= A*t + B*t2/2 +
C*t3/3 + D*t4/4 − E/t + F − H
S° = A*ln(t) + B*t + C*t2/2 + D*t3/3 −
E/(2*t2) + G
Cp = heat capacity (J/mol*K)
H° = standard enthalpy (kJ/mol)
S° = standard entropy (J/mol*K)
t = temperature (K) / 1000.
View plot Requires a JavaScript / HTML 5 canvas capable browser.
Temperature (K) | 1045. to 3000. |
---|---|
A | 102.5331 |
B | 2.006254×10-8 |
C | -9.234423×10-9 |
D | 1.407022×10-9 |
E | 2.609206×10-9 |
F | -815.0014 |
G | 225.6381 |
H | -774.0944 |
Reference | Chase, 1998 |
Comment | Data last reviewed in June, 1970 |
Solid Phase Heat Capacity (Shomate Equation)
Cp° = A + B*t + C*t2 + D*t3 +
E/t2
H° − H°298.15= A*t + B*t2/2 +
C*t3/3 + D*t4/4 − E/t + F − H
S° = A*ln(t) + B*t + C*t2/2 + D*t3/3 −
E/(2*t2) + G
Cp = heat capacity (J/mol*K)
H° = standard enthalpy (kJ/mol)
S° = standard entropy (J/mol*K)
t = temperature (K) / 1000.
View plot Requires a JavaScript / HTML 5 canvas capable browser.
Temperature (K) | 298. to 1045. |
---|---|
A | 87.29581 |
B | -35.07644 |
C | 44.12781 |
D | -9.848049 |
E | -0.674264 |
F | -822.9008 |
G | 215.0522 |
H | -795.7968 |
Reference | Chase, 1998 |
Comment | Data last reviewed in June, 1970 |

Gas phase ion energetics data

Data compiled as indicated in comments:
LBLHLM - Sharon G. Lias, John E. Bartmess, Joel F. Liebman, John L. Holmes, Rhoda D. Levin, and W. Gary Mallard
LLK - Sharon G. Lias, Rhoda D. Levin, and Sherif A. Kafafi
RDSH - Henry M. Rosenstock, Keith Draxl, Bruce W. Steiner, and John T. Herron
Ionization energy determinations
IE (eV) | Method | Reference | Comment |
---|---|---|---|
10.9 | S | Emons, Kiessling, et al., 1982 | LBLHLM |
10.99 ± 0.04 | PE | Lee and Potts, 1979 | LLK |
10.33 ± 0.10 | EI | Hildenbrand, 1970 | RDSH |
10.5 ± 0.3 | EI | Hildenbrand, 1970, 2 | RDSH |
10.2 | PE | Hammer, Allen, et al., 1978 | Vertical value; LLK |
Appearance energy determinations
Ion | AE (eV) | Other Products | Method | Reference | Comment |
---|---|---|---|---|---|
Ca+ | 15.94 ± 0.10 | 2Cl | EI | Hildenbrand, 1970 | RDSH |
CaCl+ | 11.3 | Cl | S | Emons, Kiessling, et al., 1982 | LBLHLM |
CaCl+ | 10.96 ± 0.10 | Cl | EI | Hildenbrand, 1970 | RDSH |
CaCl+ | 11.0 ± 0.2 | Cl | EI | Hildenbrand, 1970, 2 | RDSH |

Reaction thermochemistry data

Data compiled by: Hussein Y. Afeefy, Joel F. Liebman, and Stephen E. Stein
Individual Reactions
H2CaO2 + 2 = CaCl2 + 2
+ 2
By formula: H2CaO2 + 2C2HCl5 = CaCl2 + 2C2Cl4 + 2H2O
Quantity | Value | Units | Method | Reference | Comment |
---|---|---|---|---|---|
ΔrH° | -181.6 | kJ/mol | Cm | Kirkbride, 1956 | liquid phase |
H2CaO2 + 2 = CaCl2 + 2
+ 2
By formula: H2CaO2 + 2C2H2Cl4 = CaCl2 + 2H2O + 2C2HCl3
Quantity | Value | Units | Method | Reference | Comment |
---|---|---|---|---|---|
ΔrH° | -150. | kJ/mol | Cm | Kirkbride, 1956 | liquid phase |

References

Chase, 1998
Chase, M.W., Jr.,
NIST-JANAF Themochemical Tables, Fourth Edition,
J. Phys. Chem. Ref. Data, Monograph 9, 1998, 1-1951. [all data]
Emons, Kiessling, et al., 1982
Emons, H.-H.; Kiessling, D.; Horlbeck, W.,
Dampfdruckmessungen und massenspektrometrische untersuchungen der gasphase uber erdalkalimetallhalogeniden,
Z. Anorg. Allg. Chem., 1982, 488, 219. [all data]
Lee and Potts, 1979
Lee, E.P.F.; Potts, A.W.,
An investigation of the valence shell electronic structure of alkaline earth halides by using Ab initio S. C. F. calculations and photoelectron spectroscopy,
Proc. R. Soc. London A:, 1979, 365, 395. [all data]
Hildenbrand, 1970
Hildenbrand, D.L.,
Electron impact studies of the IIA metal chlorides,
Intern. J. Mass Spectrom. Ion Phys., 1970, 4, 75. [all data]
Hildenbrand, 1970, 2
Hildenbrand, D.L.,
Dissociation energies and chemical bonding in the alkaline-earth chlorides from mass spectrometric studies,
J. Chem. Phys., 1970, 52, 5751. [all data]
Hammer, Allen, et al., 1978
Hammer, C.A.; Allen, J.D., Jr.; Cusachs, L.C.; Schweitzer, G.K.,
The high-temperature photoelectron spectra of alkaline-earth chlorides and iodides,
J. Electron Spectrosc. Relat. Phenom., 1978, 13, 149. [all data]