Styrene
- Formula: C8H8
- Molecular weight: 104.1491
- IUPAC Standard InChIKey: PPBRXRYQALVLMV-UHFFFAOYSA-N
- CAS Registry Number: 100-42-5
- Chemical structure:
View 3d structure (requires JavaScript / HTML 5) - Other names: Benzene, ethenyl-; Bulstren K-525-19; Cinnamene; Phenethylene; Phenylethene; Phenylethylene; Styrol (German); Styrole; Styrolene; Styropol SO; Vinylbenzene; Vinylbenzol; Ethenylbenzene; Cinnaminol; Cinnamol; Styrol; Benzene, vinyl-; Cinnamenol; Ethylene, phenyl-; NCI-C02200; Stirolo; Styreen; Styren; Styrene monomer; Vinylbenzen; Annamene; NSC 62785; ethenylbenzene (styrene); Vinylbenzene (styrene)

Gas phase thermochemistry data

Data compiled as indicated in comments:
ALS - Hussein Y. Afeefy, Joel F. Liebman, and Stephen E. Stein
DRB - Donald R. Burgess, Jr.
GT - Glushko Thermocenter, Russian Academy of Sciences, Moscow
Quantity | Value | Units | Method | Reference | Comment |
---|---|---|---|---|---|
ΔfH°gas | 35.11 ± 0.24 | kcal/mol | Ccb | Prosen and Rossini, 1945 | ALS |
ΔfH°gas | 36.21 | kcal/mol | N/A | Landrieu, Baylocq, et al., 1929 | Value computed using ΔfHliquid° value of 108.0 kj/mol from Landrieu, Baylocq, et al., 1929 and ΔvapH° value of 43.5 kj/mol from Prosen and Rossini, 1945.; DRB |
ΔfH°gas | 31.43 ± 0.96 | kcal/mol | Ccb | N/A | Value computed using ΔfHliquid° from missing citation and ΔvapH° value of 10.5 kcal/mol from Pitzer, Guttman, et al., 1946. recalculated with modern CO2,H2O thermo; estimated uncertainty (NOTE all values in source also have wrong sign); DRB |
ΔfH°gas | -3.61 | kcal/mol | N/A | Moureu and Andre, 1914 | Value computed using ΔfHliquid° value of -58.6 kj/mol from Moureu and Andre, 1914 and ΔvapH° value of 43.5 kj/mol from Prosen and Rossini, 1945.; DRB |
Quantity | Value | Units | Method | Reference | Comment |
S°gas | 82.48 ± 0.50 | cal/mol*K | N/A | Pitzer K.S., 1946 | S(298.16 K)=343.38 J/mol*K was obtained from earlier experimental data [ Guttman L., 1943].; GT |
Constant pressure heat capacity of gas
Cp,gas (cal/mol*K) | Temperature (K) | Reference | Comment |
---|---|---|---|
36.16 ± 0.18 | 373.15 | Scott R.B., 1945 | GT |
Constant pressure heat capacity of gas
Cp,gas (cal/mol*K) | Temperature (K) | Reference | Comment |
---|---|---|---|
10.94 | 50. | Thermodynamics Research Center, 1997 | p=1 bar. Recommended values agree with other statistically calculated values of S(T) and Cp(T) [ Beckett C.W., 1946] within 0.8 and 1.9 J/mol*K, respectively.; GT |
12.95 | 100. | ||
15.73 | 150. | ||
19.54 | 200. | ||
26.298 | 273.15 | ||
28.726 | 298.15 | ||
28.905 | 300. | ||
38.191 | 400. | ||
46.030 | 500. | ||
52.34 | 600. | ||
57.46 | 700. | ||
61.66 | 800. | ||
65.20 | 900. | ||
68.16 | 1000. | ||
70.70 | 1100. | ||
72.87 | 1200. | ||
74.74 | 1300. | ||
76.34 | 1400. | ||
77.72 | 1500. |

Condensed phase thermochemistry data

Data compiled as indicated in comments:
ALS - Hussein Y. Afeefy, Joel F. Liebman, and Stephen E. Stein
DRB - Donald R. Burgess, Jr.
DH - Eugene S. Domalski and Elizabeth D. Hearing
Quantity | Value | Units | Method | Reference | Comment |
---|---|---|---|---|---|
ΔfH°liquid | 24.72 ± 0.22 | kcal/mol | Ccb | Prosen and Rossini, 1945 | ALS |
ΔfH°liquid | 25.8 | kcal/mol | Ccb | Landrieu, Baylocq, et al., 1929 | ALS |
ΔfH°liquid | 20.9 ± 0.96 | kcal/mol | Ccb | N/A | recalculated with modern CO2,H2O thermo; estimated uncertainty (NOTE all values in source also have wrong sign); DRB |
ΔfH°liquid | -14.0 | kcal/mol | Ccb | Moureu and Andre, 1914 | ALS |
Quantity | Value | Units | Method | Reference | Comment |
ΔcH°liquid | -1050. ± 10. | kcal/mol | AVG | N/A | Average of 9 values; Individual data points |
Quantity | Value | Units | Method | Reference | Comment |
S°liquid | 57.48 | cal/mol*K | N/A | Warfield and Petree, 1961 | DH |
S°liquid | 56.781 | cal/mol*K | N/A | Pitzer, Guttman, et al., 1946, 2 | DH |
S°liquid | 56.79 | cal/mol*K | N/A | Guttman and Westrum, 1943 | DH |
Constant pressure heat capacity of liquid
Cp,liquid (cal/mol*K) | Temperature (K) | Reference | Comment |
---|---|---|---|
43.79 | 298.15 | Lebedev, Lebedev, et al., 1985 | DH |
43.64 | 298.16 | Warfield and Petree, 1961 | T = 10 to 300 K.; DH |
56.31 | 298. | Kurbatov, 1950 | T = 21 to 139 C.; DH |
43.700 | 298.15 | Pitzer, Guttman, et al., 1946, 2 | T = 15 to 300 K.; DH |
43.00 | 298.5 | Smith and Andrews, 1931 | T = 102 to 299 K. Value is unsmoothed experimental datum.; DH |

Phase change data

Data compiled as indicated in comments:
BS - Robert L. Brown and Stephen E. Stein
TRC - Thermodynamics Research Center, NIST Boulder Laboratories, Chris Muzny director
ALS - Hussein Y. Afeefy, Joel F. Liebman, and Stephen E. Stein
AC - William E. Acree, Jr., James S. Chickos
DRB - Donald R. Burgess, Jr.
DH - Eugene S. Domalski and Elizabeth D. Hearing
Quantity | Value | Units | Method | Reference | Comment |
---|---|---|---|---|---|
Tboil | 419. ± 2. | K | AVG | N/A | Average of 18 out of 19 values; Individual data points |
Quantity | Value | Units | Method | Reference | Comment |
Tfus | 240. ± 30. | K | AVG | N/A | Average of 10 values; Individual data points |
Quantity | Value | Units | Method | Reference | Comment |
Ttriple | 242.47 | K | N/A | Pitzer, Guttman, et al., 1946, 3 | Uncertainty assigned by TRC = 0.07 K; TRC |
Ttriple | 242.47 | K | N/A | Guttman, Westrum, et al., 1943 | Uncertainty assigned by TRC = 0.1 K; TRC |
Ttriple | 242.47 | K | N/A | Guttman, 1943 | Uncertainty assigned by TRC = 0.1 K; temperature scale based on To = 273.16 K; TRC |
Quantity | Value | Units | Method | Reference | Comment |
ΔvapH° | 10.50 ± 0.10 | kcal/mol | V | Pitzer, Guttman, et al., 1946 | ALS |
ΔvapH° | 10.5 | kcal/mol | N/A | Pitzer, Guttman, et al., 1946, 2 | Based on data from 285. to 333. K.; AC |
ΔvapH° | 10.4 ± 0.1 | kcal/mol | N/A | Pitzer, Guttman, et al., 1946, 2 | AC |
ΔvapH° | 10.4 | kcal/mol | N/A | Prosen and Rossini, 1945 | DRB |
ΔvapH° | 10.3 | kcal/mol | N/A | Patnode and Scheiber, 1939 | Based on data from 245. to 357. K.; AC |
Enthalpy of vaporization
ΔvapH (kcal/mol) | Temperature (K) | Method | Reference | Comment |
---|---|---|---|---|
10.2 | 260. | A | Stephenson and Malanowski, 1987 | Based on data from 245. to 334. K.; AC |
9.92 | 349. | A | Stephenson and Malanowski, 1987 | Based on data from 334. to 419. K.; AC |
10.2 | 319. | N/A | Chaiyavech and Van Winkle, 1959 | Based on data from 306. to 333. K.; AC |
10.3 | 318. | N/A | Dreyer, Martin, et al., 1955 | Based on data from 303. to 417. K.; AC |
9.61 | 348. | N/A | Burchfield, 1942 | Based on data from 306. to 389. K.; AC |
Antoine Equation Parameters
log10(P) = A − (B / (T + C))
P = vapor pressure (atm)
T = temperature (K)
View plot Requires a JavaScript / HTML 5 canvas capable browser.
Temperature (K) | A | B | C | Reference | Comment |
---|---|---|---|---|---|
305.6 to 355.34 | 4.0536 | 1459.909 | -59.551 | Chaiyavech and Van Winkle, 1959 | Coefficents calculated by NIST from author's data. |
303.07 to 417.92 | 4.21377 | 1525.059 | -56.379 | Dreyer, Martin, et al., 1955 | Coefficents calculated by NIST from author's data. |
Enthalpy of fusion
ΔfusH (kcal/mol) | Temperature (K) | Reference | Comment |
---|---|---|---|
2.6205 | 242.27 | Warfield and Petree, 1961 | DH |
2.6169 | 242.27 | Pitzer, Guttman, et al., 1946, 2 | DH |
2.6171 | 242.47 | Guttman and Westrum, 1943 | DH |
2.6171 | 242.47 | Lebedev, Lebedev, et al., 1985 | DH |
2.620 | 242.3 | Domalski and Hearing, 1996 | AC |
Entropy of fusion
ΔfusS (cal/mol*K) | Temperature (K) | Reference | Comment |
---|---|---|---|
10.83 | 242.27 | Warfield and Petree, 1961 | DH |
10.79 | 242.27 | Pitzer, Guttman, et al., 1946, 2 | DH |
10.79 | 242.47 | Guttman and Westrum, 1943 | DH |
10.8 | 242.47 | Lebedev, Lebedev, et al., 1985 | DH |

Reaction thermochemistry data

Data compiled as indicated in comments:
B - John E. Bartmess
M - Michael M. Meot-Ner (Mautner) and Sharon G. Lias
ALS - Hussein Y. Afeefy, Joel F. Liebman, and Stephen E. Stein
Individual Reactions
Quantity | Value | Units | Method | Reference | Comment |
---|---|---|---|---|---|
ΔrH° | 391.0 ± 2.5 | kcal/mol | TDEq | Meot-ner and Kafafi, 1988 | gas phase; Acid: styrene. AM1 says ortho deprotonation prefered to alpha. Anchored to 88MEO scale.; B |
Quantity | Value | Units | Method | Reference | Comment |
ΔrG° | 383.4 ± 2.0 | kcal/mol | TDEq | Meot-ner and Kafafi, 1988 | gas phase; Acid: styrene. AM1 says ortho deprotonation prefered to alpha. Anchored to 88MEO scale.; B |
By formula: C3H9Si+ + C8H8 = (C3H9Si+ • C8H8)
Quantity | Value | Units | Method | Reference | Comment |
---|---|---|---|---|---|
ΔrH° | 36.6 | kcal/mol | PHPMS | Li and Stone, 1989 | gas phase; condensation; M |
Quantity | Value | Units | Method | Reference | Comment |
ΔrS° | 42.4 | cal/mol*K | PHPMS | Li and Stone, 1989 | gas phase; condensation; M |
By formula: C8H8 + 4H2 = C8H16
Quantity | Value | Units | Method | Reference | Comment |
---|---|---|---|---|---|
ΔrH° | -76.50 ± 0.25 | kcal/mol | Chyd | Dolliver, Gresham, et al., 1937 | gas phase; Reanalyzed by Cox and Pilcher, 1970, Original value = -77.48 ± 0.20 kcal/mol; At 355 °K; ALS |
(CAS Reg. No. 13822-53-2 • 4294967295) +
= CAS Reg. No. 13822-53-2
By formula: (CAS Reg. No. 13822-53-2 • 4294967295C8H8) + C8H8 = CAS Reg. No. 13822-53-2
Quantity | Value | Units | Method | Reference | Comment |
---|---|---|---|---|---|
ΔrH° | 48.9 ± 2.2 | kcal/mol | N/A | Bartmess, Scott, et al., 1979 | gas phase; value altered from reference due to change in acidity scale; B |
Quantity | Value | Units | Method | Reference | Comment |
---|---|---|---|---|---|
ΔrH° | -28.01 ± 0.41 | kcal/mol | Chyd | Abboud, Jimenez, et al., 1995 | liquid phase; solvent: Hydrocarbon; Like gas phase; ALS |
By formula: C8H8 + HCl = C8H9Cl
Quantity | Value | Units | Method | Reference | Comment |
---|---|---|---|---|---|
ΔrH° | -13.3 ± 1.7 | kcal/mol | Cm | Nesterova, Kovzel, et al., 1977 | liquid phase; Hydrochlorination; ALS |
By formula: HBr + C8H8 = C8H9Br
Quantity | Value | Units | Method | Reference | Comment |
---|---|---|---|---|---|
ΔrH° | -16.5 ± 1.7 | kcal/mol | Cm | Nesterova, Kovzel, et al., 1977 | liquid phase; Hydrobromination; ALS |
By formula: C8H8 = C8H8
Quantity | Value | Units | Method | Reference | Comment |
---|---|---|---|---|---|
ΔrH° | -34.35 ± 0.34 | kcal/mol | Ciso | Prosen, Johnson, et al., 1947 | liquid phase; ALS |
Quantity | Value | Units | Method | Reference | Comment |
---|---|---|---|---|---|
ΔrH° | 29.840 | kcal/mol | Eqk | Ghosh, Ram Das Guha, et al., 1945 | gas phase; ALS |

Henry's Law data

Data compiled by: Rolf Sander
Henry's Law constant (water solution)
kH(T) = k°H exp(d(ln(kH))/d(1/T) ((1/T) - 1/(298.15 K)))
k°H = Henry's law constant for solubility in water at 298.15 K (mol/(kg*bar))
d(ln(kH))/d(1/T) = Temperature dependence constant (K)
k°H (mol/(kg*bar)) | d(ln(kH))/d(1/T) (K) | Method | Reference | Comment |
---|---|---|---|---|
0.37 | Q | N/A | missing citation give several references for the Henry's law constants but don't assign them to specific species. | |
0.29 | 4800. | X | N/A | |
0.38 | 4200. | X | N/A |

Gas phase ion energetics data

Data evaluated as indicated in comments:
HL - Edward P. Hunter and Sharon G. Lias
L - Sharon G. Lias
Data compiled as indicated in comments:
B - John E. Bartmess
LL - Sharon G. Lias and Joel F. Liebman
LLK - Sharon G. Lias, Rhoda D. Levin, and Sherif A. Kafafi
RDSH - Henry M. Rosenstock, Keith Draxl, Bruce W. Steiner, and John T. Herron
Quantity | Value | Units | Method | Reference | Comment |
---|---|---|---|---|---|
IE (evaluated) | 8.464 ± 0.001 | eV | N/A | N/A | L |
Quantity | Value | Units | Method | Reference | Comment |
Proton affinity (review) | 200.6 | kcal/mol | N/A | Hunter and Lias, 1998 | HL |
Quantity | Value | Units | Method | Reference | Comment |
Gas basicity | 193.4 | kcal/mol | N/A | Hunter and Lias, 1998 | HL |
Ionization energy determinations
IE (eV) | Method | Reference | Comment |
---|---|---|---|
8.464 ± 0.001 | TE | Dyke, Ozeki, et al., 1992 | LL |
8.47 | PE | Kimura, Katsumata, et al., 1981 | LLK |
8.43 | PI | Fu and Dunbar, 1978 | LLK |
8.2 ± 0.1 | EI | Reeher, Flesch, et al., 1976 | LLK |
8.42 | PE | Rabalais and Colton, 1973 | LLK |
8.40 ± 0.02 | PE | Maier and Turner, 1973 | LLK |
8.28 ± 0.04 | EI | Benito, Seidl, et al., 1973 | LLK |
8.53 | CTS | Lossing and Semeluk, 1969 | RDSH |
8.43 ± 0.01 | PE | Dewar and Worley, 1969 | RDSH |
8.42 | PE | Turner, 1966 | RDSH |
8.47 ± 0.02 | PI | Watanabe, Nakayama, et al., 1962 | RDSH |
8.48 | PE | Kobayashi, 1978 | Vertical value; LLK |
8.58 | PI | Fu and Dunbar, 1978 | Vertical value; LLK |
8.50 | PE | Bruckmann and Klessinger, 1974 | Vertical value; LLK |
8.49 | PE | Kobayashi, Yokota, et al., 1973 | Vertical value; LLK |
8.55 | PE | Bock, Wagner, et al., 1972 | Vertical value; LLK |
8.55 | PE | Bock and Wagner, 1972 | Vertical value; LLK |
Appearance energy determinations
Ion | AE (eV) | Other Products | Method | Reference | Comment |
---|---|---|---|---|---|
C3H3+ | 14.90 ± 0.10 | ? | EI | Franklin and Carroll, 1969 | RDSH |
C4H2+ | 19.85 ± 0.25 | 2C2H2+H2 | EI | Franklin and Carroll, 1969 | RDSH |
C4H2+ | 20.22 ± 0.10 | 2C2H2+H2 | EI | Franklin and Carroll, 1969 | RDSH |
C4H3+ | 19.61 ± 0.10 | 2C2H2+H | EI | Franklin and Carroll, 1969 | RDSH |
C4H4+ | 17.25 ± 0.15 | 2C2H2 | EI | Franklin and Carroll, 1969 | RDSH |
C5H3+ | 17.74 ± 0.10 | C2H2+CH3? | EI | Franklin and Carroll, 1969 | RDSH |
C6H5+ | 16.02 ± 0.10 | C2H2+H | EI | Franklin and Carroll, 1969 | RDSH |
C6H6+ | 12.38 ± 0.05 | C2H2 | EI | Franklin and Carroll, 1969 | RDSH |
C6H6+ | 12.30 ± 0.10 | C2H2 | EI | Franklin and Carroll, 1969 | RDSH |
C8H6+ | 12.72 ± 0.10 | H2 | EI | Franklin and Carroll, 1969 | RDSH |
C8H7+ | 12.41 ± 0.10 | H | EI | Franklin and Carroll, 1969 | RDSH |
De-protonation reactions
Quantity | Value | Units | Method | Reference | Comment |
---|---|---|---|---|---|
ΔrH° | 391.0 ± 2.5 | kcal/mol | TDEq | Meot-ner and Kafafi, 1988 | gas phase; Acid: styrene. AM1 says ortho deprotonation prefered to alpha. Anchored to 88MEO scale.; B |
Quantity | Value | Units | Method | Reference | Comment |
ΔrG° | 383.4 ± 2.0 | kcal/mol | TDEq | Meot-ner and Kafafi, 1988 | gas phase; Acid: styrene. AM1 says ortho deprotonation prefered to alpha. Anchored to 88MEO scale.; B |

Ion clustering data

Data compiled by: Michael M. Meot-Ner (Mautner) and Sharon G. Lias
Clustering reactions
By formula: C3H9Si+ + C8H8 = (C3H9Si+ • C8H8)
Quantity | Value | Units | Method | Reference | Comment |
---|---|---|---|---|---|
ΔrH° | 36.6 | kcal/mol | PHPMS | Li and Stone, 1989 | gas phase; condensation |
Quantity | Value | Units | Method | Reference | Comment |
ΔrS° | 42.4 | cal/mol*K | PHPMS | Li and Stone, 1989 | gas phase; condensation |

Normal alkane RI, polar column, temperature ramp

Data compiled by: NIST Mass Spectrometry Data Center, William E. Wallace, director

Column type CapillaryCapillaryCapillaryCapillaryCapillary
Active phase HP-InnowaxInnowaxStabilwaxDB-WaxDB-Wax
Column length (m) 15.30.30.60.60.
Carrier gas HeliumHeliumHeliumHeliumHelium
Substrate
Column diameter (mm) 0.320.250.250.320.32
Phase thickness (μm) 0.500.250.500.250.25
Tstart (C) 40.40.35.30.30.
Tend (C) 250.250.225.200.200.
Heat rate (K/min) 3.8.6.2.2.
Initial hold (min)  1.5.4.4.
Final hold (min)  2.7510.30.30.
I 1229.1262.1241.1247.1252.
ReferencePuvipirom and Chaisei, 2012Siristova, Prinosilova, et al., 2012Watcharananun, Cadwallader, et al., 2009Beck, Higbee, et al., 2008Beck, Higbee, et al., 2008
Comment MSDC-RI MSDC-RI MSDC-RI MSDC-RI MSDC-RI
Column type CapillaryCapillaryCapillaryCapillaryCapillary
Active phase InnowaxHP-InnowaxStabilwaxFFAPZB-Wax
Column length (m) 30.50.60.30.60.
Carrier gas  HeliumHeliumN2He
Substrate
Column diameter (mm) 0.250.200.250.320.32
Phase thickness (μm) 0.250.200.250.50.5
Tstart (C) 40.45.40.35.40.
Tend (C) 200.190.240.320.250.
Heat rate (K/min) 10.4.3.4.3.
Initial hold (min) 5.2.5.5.2.
Final hold (min) 15.50.10.45.10.
I 1252.1264.1248.1268.1277.
ReferenceKaypak and Avsar, 2008Soria, Sanz, et al., 2008Cros, Vandanjon, et al., 2007Nebesny, Budryn, et al., 2007Wierda R.L., Fletcher G., et al., 2006
Comment MSDC-RI MSDC-RI MSDC-RI MSDC-RI MSDC-RI
Column type CapillaryCapillaryCapillaryCapillaryCapillary
Active phase Carbowax 20MCarbowax 20MPEG-20MHP-InnowaxStabilwax
Column length (m) 50.50.50.50.60.
Carrier gas  Helium HeHelium
Substrate
Column diameter (mm) 0.20.250.200.20.25
Phase thickness (μm) 0.250.250.200.20.25
Tstart (C) 60.40.40.45.40.
Tend (C) 250.190.180.190.240.
Heat rate (K/min) 2.4.3.4.3.
Initial hold (min) 60.2.5.2.5.
Final hold (min)  30.30.50.10.
I 1270.1239.1249.1257.1248.
ReferenceFernandez, Lizzani-Cuvelier, et al., 2005de la Fuente, Martinez-Castro, et al., 2005Narain, Almeida, et al., 2004Soria, Gonzalez, et al., 2004Cros, Vandanjon, et al., 2003
Comment MSDC-RI MSDC-RI MSDC-RI MSDC-RI MSDC-RI
Column type CapillaryCapillaryCapillaryCapillaryCapillary
Active phase DB-WaxDB-WaxDB-WaxHP-WaxHP-Wax
Column length (m) 30.30.30.60.60.
Carrier gas He  HeHe
Substrate
Column diameter (mm) 0.250.250.250.250.25
Phase thickness (μm) 0.250.250.250.50.5
Tstart (C) 50.30.30.40.40.
Tend (C) 230.250.250.190.190.
Heat rate (K/min) 3.4.4.3.3.
Initial hold (min) 2.1.1.6.6.
Final hold (min) 20.
I 1250.1252.1252.1273.1240.
ReferenceLin, Cai, et al., 2003Tanaka, Yamauchi, et al., 2003Tanaka, Yamauchi, et al., 2003Sanz, Maeztu, et al., 2002Sanz, Maeztu, et al., 2002
Comment MSDC-RI MSDC-RI MSDC-RI MSDC-RI MSDC-RI
Column type CapillaryCapillaryCapillaryCapillaryCapillary
Active phase HP-WaxSupelcowax-10Supelcowax-10Carbowax 20MDB-Wax
Column length (m) 60.60.60.50.60.
Carrier gas HeH2HeHeHe
Substrate
Column diameter (mm) 0.250.320.250.250.32
Phase thickness (μm) 0.50.50.25 0.25
Tstart (C) 40.35.40.60.30.
Tend (C) 190.250.200.180.180.
Heat rate (K/min) 3.5.3.2.2.
Initial hold (min) 6.5.3.4.4.
Final hold (min)  20.30.
I 1273.1273.1255.1240.1242.
ReferenceSanz, Ansorena, et al., 2001Campeanu, Burcea, et al., 1998Wong and Lai, 1996Kawakami, Kobayashi, et al., 1993Takeoka and Butter, 1989
Comment MSDC-RI MSDC-RI MSDC-RI MSDC-RI MSDC-RI
Column type CapillaryCapillaryCapillaryCapillaryCapillary
Active phase DB-WaxDB-WaxDB-WaxDB-WaxDB-Wax
Column length (m) 60.60.60.60.60.
Carrier gas HeHeHeHeHe
Substrate
Column diameter (mm) 0.320.320.320.320.32
Phase thickness (μm) 0.250.250.250.250.25
Tstart (C) 30.30.30.30.30.
Tend (C) 180.180.180.180.180.
Heat rate (K/min) 2.2.2.2.2.
Initial hold (min) 4.4.4.4.4.
Final hold (min)
I 1243.1252.1252.1253.1253.
ReferenceTakeoka and Butter, 1989Takeoka and Butter, 1989Takeoka and Butter, 1989Takeoka and Butter, 1989Takeoka and Butter, 1989
Comment MSDC-RI MSDC-RI MSDC-RI MSDC-RI MSDC-RI

Van Den Dool and Kratz RI, non-polar column, custom temperature program

Data compiled by: NIST Mass Spectrometry Data Center, William E. Wallace, director

Column type CapillaryCapillaryCapillaryCapillaryCapillary
Active phase HP-5MSHP-5MSCP Sil 8 CBCP Sil 8 CBMethyl Silicone
Column length (m) 30.30.60.60.50.
Carrier gas HeHeHe He
Substrate
Column diameter (mm) 0.250.250.250.250.25
Phase thickness (μm) 0.250.250.250.251.
Program 50C(4min) => 10C/min => 200C(0.5min) => 20C/min => 260C(5min)5C(8min) => 3C/min => 20C => 10C/min => 150C(10min)0C => rapidly => 40C(8min) => 4C/min => 250C(10min)0C => rapidly => 40C(8min) => 4C/min => 250C(10min)-50C(2min) => 49.9C/min => 35C(10min) => 3C/min => 200C(2min) => 40C/min => 240C(30min)
I 898.898.894.897.900.02
ReferencePérez, Navarro, et al., 2007Bonaiti, Irlinger, et al., 2005Oruna-Concha, Bakker, et al., 2002Duckham, Dodson, et al., 2001Hassoun, Pilling, et al., 1999
Comment MSDC-RI MSDC-RI MSDC-RI MSDC-RI MSDC-RI
Column type CapillaryCapillaryCapillary
Active phase BPX-5BPX-5DB-1
Column length (m) 50.50.30.
Carrier gas HeHeHe
Substrate
Column diameter (mm) 0.320.320.32
Phase thickness (μm) 0.50.51.
Program OC (5min) => 60C/min => 60C(5min) => 4C/min => 250COC => 60C/min => 60C(5min) => 4C/min => 250C(20min)40C(3min) => 5C/min => 150C => 10C/min => 210C(30min)
I 905.904.871.
ReferenceBredie, Mottram, et al., 1998Owens J.D., Allagheny N., et al., 1997Mattinen, Tuominen, et al., 1995
Comment MSDC-RI MSDC-RI MSDC-RI

Lee's RI, non-polar column, custom temperature program

Data compiled by: NIST Mass Spectrometry Data Center, William E. Wallace, director

Column type CapillaryCapillary
Active phase DB-5MSHP-5MS
Column length (m) 60.30.
Carrier gas  He
Substrate
Column diameter (mm) 0.250.30
Phase thickness (μm)  0.25
Program not specified50 0C (2 min) 8 0C/min -> 120 0C (3 min) 10 0C/min -> 230 0C
I 127.7135.40
ReferenceAracil, Font, et al., 2005Cheng, Liu, et al., 2005
Comment MSDC-RI MSDC-RI

Normal alkane RI, polar column, custom temperature program

Data compiled by: NIST Mass Spectrometry Data Center, William E. Wallace, director

Column type CapillaryCapillaryCapillaryCapillaryCapillary
Active phase InnowaxDB-WaxDB-WaxBP-20BP-20
Column length (m) 30.60.30.30.30.
Carrier gas HeliumHeliumHydrogenHeliumHe
Substrate
Column diameter (mm) 0.250.250.250.250.25
Phase thickness (μm) 0.250.500.250.250.25
Program not specified40 0C 4 0C/min -> 230 0C 100 0C/min -> 260 0C (11.7 min)35 0C (9 min) 5 0C/min -> 80 0C 1 0C/min -> 100 0C 16 0C/min -> 210 0C (20 min)40 0C (1 min) 2 0C/min -> 100 0C (2 min) 1.7 0C/min -> 180 0C (1 min) 25 0C/min -> 220 0C (10 min)50C(1min) => 2.5C/min => 100C => 2C/min => 180C => 15C/min => 220C
I 1263.1262.1248.1310.1254.
ReferenceSiristova, Prinosilova, et al., 2012Miyazaki, Plotto, et al., 2011Sampaio, Garruti, et al., 2011Rodrigues, Caldera, et al., 2008Pontes, Marques, et al., 2007
Comment MSDC-RI MSDC-RI MSDC-RI MSDC-RI MSDC-RI
Column type CapillaryCapillaryCapillaryCapillaryCapillary
Active phase Supelcowax-10Innowax FSCCarbowax 20MHP Innowax FSPHP Innowax FSP
Column length (m) 30.60. 60.60.
Carrier gas HeHe HeHe
Substrate
Column diameter (mm) 0.250.25 0.250.25
Phase thickness (μm) 0.250.25 0.250.25
Program 40C(3min) => 4C/min => 75C => 8C/min => 250C(5min)60C(10min) => 4C/min => 220C(10min) => 1C/min => 240Cnot specified60C(10min) => 4C/min => 220C (10min) => 1C/min => 240C60C(10min) => 4C/min => 220C (10min) => 1C/min => 240C
I 1266.1274.1255.1272.1272.
ReferenceVichi, Guadayol, et al., 2007Baser, Özek, et al., 2004Cornwell and Cordano, 2003Tasdemir, Demirci, et al., 2003Tasdemir, Demirci, et al., 2003
Comment MSDC-RI MSDC-RI MSDC-RI MSDC-RI MSDC-RI
Column type CapillaryCapillary
Active phase DB-WaxCarbowax 20M
Column length (m) 60.
Carrier gas He
Substrate
Column diameter (mm) 0.32
Phase thickness (μm) 0.5
Program 50C(6min) => 1C/min => 130C => 10C/min => 240C (15min)not specified
I 1262.1272.
ReferencePiveteau, le Guen, et al., 2000Ramsey and Flanagan, 1982
Comment MSDC-RI MSDC-RI

Normal alkane RI, non-polar column, isothermal

Data compiled by: NIST Mass Spectrometry Data Center, William E. Wallace, director

Column type CapillaryCapillaryCapillaryCapillaryCapillary
Active phase DB-1OV-101OV-101OV-101OV-101
Column length (m) 60.50.50.50.50.
Carrier gas HeNitrogenNitrogenNitrogenNitrogen
Substrate
Column diameter (mm) 0.320.300.300.300.30
Phase thickness (μm) 1.0.260.260.260.26
Temperature (C) 60.100.100.100.100.
I 873.884.885.885.885.
ReferenceShimadzu, 2003Gerasimenko and Nabivach, 1995Gerasimenko and Nabivach, 1995Gerasimenko and Nabivach, 1995Gerasimenko and Nabivach, 1995
Comment MSDC-RI MSDC-RI MSDC-RI MSDC-RI MSDC-RI
Column type CapillaryCapillaryCapillaryPackedPacked
Active phase Methyl SiliconeOV-101OV-101DC-400Polydimethyl siloxane
Column length (m) 74.620.20.3.0
Carrier gas N2  Helium
Substrate    Gas-Pak (60-80 mesh)
Column diameter (mm) 0.280.230.23
Phase thickness (μm)
Temperature (C) 50.32.80.150.110.
I 863.868.882.895.884.
ReferenceN/ABlazso, Ujszaszi, et al., 1980Blazso, Ujszaszi, et al., 1980Anderson, 1968Ferrand, 1962
Comment MSDC-RI MSDC-RI MSDC-RI MSDC-RI MSDC-RI

References

Prosen and Rossini, 1945
Prosen, E.J.; Rossini, F.D.,
Heats of formation and combustion of 1,3-butadiene and styrene,
J. Res. NBS, 1945, 34, 59-63. [all data]
Landrieu, Baylocq, et al., 1929
Landrieu, P.; Baylocq, F.; Johnson, J.R.,
Etude thermochimique dans la serie furanique,
Bull. Soc. Chim. France, 1929, 45, 36-49. [all data]
Pitzer, Guttman, et al., 1946
Pitzer, K.S.; Guttman, L.; Westrum, E.F., Jr.,
The heat capacity, heats of fusion and vaporization, vapor pressure, entropy, vibration frequencies and barrier to internal rotation of styrene,
J. Am. Chem. Soc., 1946, 68, 2209-22. [all data]
Moureu and Andre, 1914
Moureu, C.; Andre, E.,
Thermochimie des composes acetyleniques,
Ann. Chim. Phys., 1914, 1, 113-145. [all data]
Pitzer K.S., 1946
Pitzer K.S., Jr.,
The heat capacity, heats of fusion and vaporization, vapor pressure, entropy, vibrational frequencies, and barrier to internal rotation of styrene,
J. Am. Chem. Soc., 1946, 68, 2209-2212. [all data]
Guttman L., 1943
Guttman L., Jr.,
The thermodynamics of styrene (phenylethylene), including equilibrium of formation from ethylbenzene,
J. Am. Chem. Soc., 1943, 65, 1246-1247. [all data]
Scott R.B., 1945
Scott R.B.,
Specific heats of gaseous 1,3-butadiene, isobutene, styrene, and ethylbenzene,
J. Res. Nat. Bur. Stand., 1945, 34, 243-254. [all data]
Thermodynamics Research Center, 1997
Thermodynamics Research Center,
Selected Values of Properties of Chemical Compounds., Thermodynamics Research Center, Texas A&M University, College Station, Texas, 1997. [all data]
Beckett C.W., 1946
Beckett C.W.,
The thermodynamics of styrene and its methyl derivatives,
J. Am. Chem. Soc., 1946, 68, 2213-2214. [all data]
Warfield and Petree, 1961
Warfield, R.W.; Petree, M.C.,
Thermodynamic properties of polystyrene and styrene,
J. Polymer Sci., 1961, 55, 497-505. [all data]
Pitzer, Guttman, et al., 1946, 2
Pitzer, K.S.; Guttman, L.; Westrum, E.F.,
Jr., The heat capacity, heats of fusion and vaporization, vapor pressure, entropy vibration frequencies and barrier to internal rotation of styrene,
J. Am. Chem. Soc., 1946, 68, 2209-2212. [all data]
Guttman and Westrum, 1943
Guttman, L.; Westrum, E.F.,
Jr., and Pitzer, K.S., The thermodynamics of styrene (phenylethylene), including equilibrium of formation from ethylbenzene,
J. Am. Chem. Soc., 1943, 65, 1246-1247. [all data]
Lebedev, Lebedev, et al., 1985
Lebedev, B.V.; Lebedev, N.K.; Smirnova, N.N.; Kozyreva, N.M.; Kirillin, A.I.; Korshak, V.V.,
The isotope effect in the thermodynamic parameters of polymerization of styrene,
Dokl. Akad. Nauk, 1985, SSSR 281, 379-383. [all data]
Kurbatov, 1950
Kurbatov, V.Ya.,
Specific heats of liquids. III. Specific heat of hydrocarbons with several noncondensed rings,
Zhur. Obshch. Khim., 1950, 20, 1139-1144. [all data]
Smith and Andrews, 1931
Smith, R.H.; Andrews, D.H.,
Thermal energy studies. I. Phenyl derivatives of methane,
ethane and some related compounds. J. Am. Chem. Soc., 1931, 53, 3644-3660. [all data]
Pitzer, Guttman, et al., 1946, 3
Pitzer, K.S.; Guttman, L.; Westrum, E.F.,
The Heat Capacity, Heats of Fusion and Vaporization, Vapor Pressure Entropy, Vib. Frequencies, and Barrier to Internal Rotation of Styrene,
J. Am. Chem. Soc., 1946, 68, 2209. [all data]
Guttman, Westrum, et al., 1943
Guttman, L.; Westrum, E.F.; Pitzer, K.S.,
The Thermodynamics of Styrene (Phenylethylene) Including the Equilibrium Formation from Ethylbenzene,
J. Am. Chem. Soc., 1943, 65, 1246. [all data]
Guttman, 1943
Guttman, L.,
, Ph.D. Thesis, Univ. Calif., Berkeley, 1943. [all data]
Patnode and Scheiber, 1939
Patnode, Winton.; Scheiber, W.J.,
The Density, Thermal Expansion, Vapor Pressure, and Refractive Index of Styrene, and the Density and Thermal Expansion of Polystyrene,
J. Am. Chem. Soc., 1939, 61, 12, 3449-3451, https://doi.org/10.1021/ja01267a066
. [all data]
Stephenson and Malanowski, 1987
Stephenson, Richard M.; Malanowski, Stanislaw,
Handbook of the Thermodynamics of Organic Compounds, 1987, https://doi.org/10.1007/978-94-009-3173-2
. [all data]
Chaiyavech and Van Winkle, 1959
Chaiyavech, Pramote; Van Winkle, Matthew,
Styrene-Ethylbenzene Vapor-Liquid Equilibria at Reduced Pressures.,
J. Chem. Eng. Data, 1959, 4, 1, 53-56, https://doi.org/10.1021/je60001a008
. [all data]
Dreyer, Martin, et al., 1955
Dreyer, R.; Martin, W.; von Weber, U.,
Die S«65533»ttigungsdampfdrucke von Benzol, Toluol, «65533»thylbenzol, Styrol, Cumol und Brombenzol zwischen 10 und 760 Torr,
J. Prakt. Chem., 1955, 1, 5-6, 324-328, https://doi.org/10.1002/prac.19550010508
. [all data]
Burchfield, 1942
Burchfield, P.E.,
Vapor Pressures of Indene, Styrene and Dicyclopentadiene,
J. Am. Chem. Soc., 1942, 64, 10, 2501-2501, https://doi.org/10.1021/ja01262a504
. [all data]
Domalski and Hearing, 1996
Domalski, Eugene S.; Hearing, Elizabeth D.,
Heat Capacities and Entropies of Organic Compounds in the Condensed Phase. Volume III,
J. Phys. Chem. Ref. Data, 1996, 25, 1, 1, https://doi.org/10.1063/1.555985
. [all data]
Meot-ner and Kafafi, 1988
Meot-ner, M.; Kafafi, S.A.,
Carbon Acidities of Aromatic Compounds,
J. Am. Chem. Soc., 1988, 110, 19, 6297, https://doi.org/10.1021/ja00227a003
. [all data]
Li and Stone, 1989
Li, X.; Stone, J.A.,
Determination of the beta silicon effect from a mass spectrometric study of the association of trimethylsilylium ion with alkenes,
J. Am. Chem. Soc., 1989, 111, 15, 5586, https://doi.org/10.1021/ja00197a013
. [all data]
Dolliver, Gresham, et al., 1937
Dolliver, M.a.; Gresham, T.L.; Kistiakowsky, G.B.; Vaughan, W.E.,
Heats of organic reactions. V. Heats of hydrogenation of various hydrocarbons,
J. Am. Chem. Soc., 1937, 59, 831-841. [all data]
Cox and Pilcher, 1970
Cox, J.D.; Pilcher, G.,
Thermochemistry of Organic and Organometallic Compounds, Academic Press, New York, 1970, 1-636. [all data]
Bartmess, Scott, et al., 1979
Bartmess, J.E.; Scott, J.A.; McIver, R.T., Jr.,
The gas phase acidity scale from methanol to phenol,
J. Am. Chem. Soc., 1979, 101, 6047. [all data]
Abboud, Jimenez, et al., 1995
Abboud, J.-L.M.; Jimenez, P.; Roux, M.V.; Turrion, C.; Lopez-Mardomingo, C.; Podosenin, A.; Rogers, D.W.; Liebman, J.F.,
Interrelations of the energetics of amides and alkenes: enthalpies of formation of N,N-dimethyl dertivatives of pivalamide, 1-adamantylcarboxamide and benzamide, and of styrene and its a-, trans-β- and β,β-methylated derivates,
J. Phys. Org. Chem., 1995, 8, 15-25. [all data]
Nesterova, Kovzel, et al., 1977
Nesterova, T.N.; Kovzel, E.N.; Karaseva, S.Ya.; Rozhnov, A.M.,
Heats of reaction of the hydrohalogenation of styrene and α-methylstyrene,
Vses. Konf. Kalorim. Rasshir. Tezisy Dokl. 7th, 1977, 1, 132. [all data]
Prosen, Johnson, et al., 1947
Prosen, E.J.; Johnson, W.H.; Rossini, F.D.,
Heat of combustion and formation of 1,3,5,7-cyclooctatetraene and its heat of isomerization to styrene,
J. Am. Chem. Soc., 1947, 69, 2068-2069. [all data]
Ghosh, Ram Das Guha, et al., 1945
Ghosh, J.C.; Ram Das Guha, S.; Roy, A.N.,
Chemical equilibrium in styrene formation from ethyl-benzene at low pressures,
Curr. Sci., 1945, 14, 269. [all data]
Hunter and Lias, 1998
Hunter, E.P.; Lias, S.G.,
Evaluated Gas Phase Basicities and Proton Affinities of Molecules: An Update,
J. Phys. Chem. Ref. Data, 1998, 27, 3, 413-656, https://doi.org/10.1063/1.556018
. [all data]
Dyke, Ozeki, et al., 1992
Dyke, J.M.; Ozeki, H.; Takahashi, M.; Cockett, M.C.R.; Kimura, K.,
A study of phenylacetylene and styrene, and their argon complexes PA-Ar and ST-Ar with laser threshold photoelectron spectroscopy,
J. Chem. Phys., 1992, 97, 8926. [all data]
Kimura, Katsumata, et al., 1981
Kimura, K.; Katsumata, S.; Achiba, Y.; Yamazaki, T.; Iwata, S.,
Ionization energies, Ab initio assignments, and valence electronic structure for 200 molecules
in Handbook of HeI Photoelectron Spectra of Fundamental Organic Compounds, Japan Scientific Soc. Press, Tokyo, 1981. [all data]
Fu and Dunbar, 1978
Fu, E.W.; Dunbar, R.C.,
Photodissociation spectroscopy and structural rearrangements in ions of cyclooctatetraene, styrene and related molecules,
J. Am. Chem. Soc., 1978, 100, 2283. [all data]
Reeher, Flesch, et al., 1976
Reeher, J.R.; Flesch, G.D.; Svec, H.J.,
The mass spectra and ionization potentials of the neutral fragments produced during the electron bombardment of aromatic compounds,
Org. Mass Spectrom., 1976, 11, 154. [all data]
Rabalais and Colton, 1973
Rabalais, J.W.; Colton, R.J.,
Electronic interaction between the phenyl group and its unsaturated substituents,
J. Electron Spectrosc. Relat. Phenom., 1973, 1, 83. [all data]
Maier and Turner, 1973
Maier, J.P.; Turner, D.W.,
Steric inhibition of resonance studied by molecular photoelectron spectroscopy. Part 2. Phenylethylenes,
J. Chem. Soc. Faraday Trans. 2, 1973, 69, 196. [all data]
Benito, Seidl, et al., 1973
Benito, I.; Seidl, H.; Bock, H.,
Efectos electronicos y estericos de sustituyentes alquilicos y silicicos sobre el sistema electronico π del estireno,
Rev. Fac. Cienc. Univ. Oviedo, 1973, 14, 95. [all data]
Lossing and Semeluk, 1969
Lossing, F.P.; Semeluk, G.P.,
Threshold ionization efficiency curves for monoenergetic electron impact on H2, D2, CH4 and CD4,
Intern. J. Mass Spectrom. Ion Phys., 1969, 2, 408. [all data]
Dewar and Worley, 1969
Dewar, M.J.S.; Worley, S.D.,
Photoelectron spectra of molecules. I. Ionization potentials of some organic molecules and their interpretation,
J. Chem. Phys., 1969, 50, 654. [all data]
Turner, 1966
Turner, D.W.,
Ionization potentials,
Advan. Phys. Org. Chem., 1966, 4, 31. [all data]
Watanabe, Nakayama, et al., 1962
Watanabe, K.; Nakayama, T.; Mottl, J.,
Ionization potentials of some molecules,
J. Quant. Spectry. Radiative Transfer, 1962, 2, 369. [all data]
Kobayashi, 1978
Kobayashi, T.,
A simple general tendency in photoelectron angular distributions of some monosubstituted benzenes,
Phys. Lett., 1978, 69, 105. [all data]
Bruckmann and Klessinger, 1974
Bruckmann, P.; Klessinger, M.,
Photoelektronenspektren organischer verbindungen. V. Wechselwirkung kleiner ringe mit π-systemen,
Chem. Ber., 1974, 107, 1108. [all data]
Kobayashi, Yokota, et al., 1973
Kobayashi, T.; Yokota, K.; Nagakura, S.,
Photoelectron spectra of styrenes,
J. Electron Spectrosc. Relat. Phenom., 1973, 3, 449. [all data]
Bock, Wagner, et al., 1972
Bock, H.; Wagner, G.; Kroner, J.,
Photoelektronenspektren und molekuleigenschaften, XIV. Die delokalisation des schwefel-elektronenpaar in CH3S-substituierten aromaten,
Chem. Ber., 1972, 105, 3850. [all data]
Bock and Wagner, 1972
Bock, H.; Wagner, G.,
Electron lone pairs in organic sulfides and disulfides,
Angew. Chem. Int. Ed. Engl., 1972, 11, 119. [all data]
Franklin and Carroll, 1969
Franklin, J.L.; Carroll, S.R.,
The effect of molecular structure on ionic decomposition. I. An electron impact study of seven C8H8 isomers,
J. Am. Chem. Soc., 1969, 91, 5940. [all data]