(E)-1-Methoxy-1,3-butadiene
- Formula: C5H8O
- Molecular weight: 84.1164
- IUPAC Standard InChIKey: KOCUMXQOUWPSLK-SNAWJCMRSA-N
- CAS Registry Number: 10034-09-0
- Chemical structure:
View 3d structure (requires JavaScript / HTML 5) - Stereoisomers:

Gas phase ion energetics data

Data compiled as indicated in comments:
LLK - Sharon G. Lias, Rhoda D. Levin, and Sherif A. Kafafi
Ionization energy determinations
IE (eV) | Method | Reference | Comment |
---|---|---|---|
8.03 | PE | Sustmann and Schubert, 1972 | LLK |

References

Sustmann and Schubert, 1972
Sustmann, R.; Schubert, R.,
Photoelektronenspektroskopische bestimmung von substituenten-effekten. I. Subtituierte butadiene,
Tetrahedron Lett., 1972, 27, 2739. [all data]