2-Thiophenecarbonitrile
- Formula: C5H3NS
- Molecular weight: 109.149
- IUPAC Standard InChIKey: CUPOOAWTRIURFT-UHFFFAOYSA-N
- CAS Registry Number: 1003-31-2
- Chemical structure:
View 3d structure (requires JavaScript / HTML 5) - Other names: Thiophene-2-carbonitrile; 2-Thenylcyanide

Phase change data

Data compiled as indicated in comments:
BS - Robert L. Brown and Stephen E. Stein
AC - William E. Acree, Jr., James S. Chickos
Quantity | Value | Units | Method | Reference | Comment |
---|---|---|---|---|---|
Tboil | 465.2 | K | N/A | Weast and Grasselli, 1989 | BS |
Quantity | Value | Units | Method | Reference | Comment |
ΔvapH° | 49.5 ± 1.1 | kJ/mol | C | Ribeiro da Silva and Santos, 2008 | AC |

Gas phase ion energetics data

Data compiled as indicated in comments:
LLK - Sharon G. Lias, Rhoda D. Levin, and Sherif A. Kafafi
Ionization energy determinations
IE (eV) | Method | Reference | Comment |
---|---|---|---|
10.00 | CTS | Aloisi, Santini, et al., 1975 | LLK |
9.83 ± 0.05 | EI | Linda, Marino, et al., 1971 | LLK |

References

Weast and Grasselli, 1989
CRC Handbook of Data on Organic Compounds, 2nd Editon, Weast,R.C and Grasselli, J.G., ed(s)., CRC Press, Inc., Boca Raton, FL, 1989, 1. [all data]
Ribeiro da Silva and Santos, 2008
Ribeiro da Silva, Manuel A.V.; Santos, Ana Filipa L.O.M.,
Thermochemistry of substituted thiophenecarbonitrile derivatives,
The Journal of Chemical Thermodynamics, 2008, 40, 2, 225-231, https://doi.org/10.1016/j.jct.2007.06.020
. [all data]
Aloisi, Santini, et al., 1975
Aloisi, G.; Santini, S.; Savelli, G.,
Molecular complexes of heteroaromatic five membered ring compounds with tetracyanoethylene. Charge transfer spectra, equilibrium constants and ionization potentials of the donors,
J. Chem. Soc. Faraday Trans. 1, 1975, 70, 2045. [all data]
Linda, Marino, et al., 1971
Linda, P.; Marino, G.; Pignataro, S.,
A comparison of sensitivities to substituent effects of five- membered heteroaromatic rings in gas phase ionization,
J. Chem. Soc. B, 1971, 1585. [all data]