1H-Pyrrole-2-carboxaldehyde
- Formula: C5H5NO
- Molecular weight: 95.0993
- IUPAC Standard InChIKey: ZSKGQVFRTSEPJT-UHFFFAOYSA-N
- CAS Registry Number: 1003-29-8
- Chemical structure:
View 3d structure (requires JavaScript / HTML 5) - Other names: Pyrrole-2-carboxaldehyde; Pyrrole-2-aldehyde; 2-Formylpyrrole; 2-Pyrrolylcarboxaldehyde; α-Pyrrolaldehyde; 2-Pyrrolecarbaldehyde; 2-Pyrrolecarboxaldehyde; 1H-Pyrrole-2-carboxyaldehyde; 2-Carboxaldehyde-1H-pyrrole; 2-Pyrrolaldehyde; 2-Pyrrolcarbaldehyde; NSC 112885; NSC 66394; 1H-Pyrrole-2-carbaldehyde; 129006-63-9; 1-Pyrrole-2-carboxaldehyde; 1( H)-pyrrole carboxaldehyde; Pyrrol-2-carboxaldehyde; pyrrole-2-carbaldehyde

Condensed phase thermochemistry data

Data compiled by: Hussein Y. Afeefy, Joel F. Liebman, and Stephen E. Stein
Quantity | Value | Units | Method | Reference | Comment |
---|---|---|---|---|---|
ΔfH°solid | -106.4 ± 2.5 | kJ/mol | Ccb | Stern and Klebs, 1933 | Reanalyzed by Cox and Pilcher, 1970, Original value = -102. kJ/mol; Heat of combustion at 288 K |
Quantity | Value | Units | Method | Reference | Comment |
ΔcH°solid | -2575.7 ± 2.5 | kJ/mol | Ccb | Stern and Klebs, 1933 | Reanalyzed by Cox and Pilcher, 1970, Original value = -2580. kJ/mol; Heat of combustion at 288 K |

Phase change data

Data compiled by: Robert L. Brown and Stephen E. Stein
Quantity | Value | Units | Method | Reference | Comment |
---|---|---|---|---|---|
Tboil | 491.2 | K | N/A | Weast and Grasselli, 1989 |

Gas phase ion energetics data

Data compiled by: Sharon G. Lias, Rhoda D. Levin, and Sherif A. Kafafi
Ionization energy determinations
IE (eV) | Method | Reference |
---|---|---|
8.93 ± 0.05 | EI | Linda, Marino, et al., 1971 |

Van Den Dool and Kratz RI, non-polar column, temperature ramp

Data compiled by: NIST Mass Spectrometry Data Center, William E. Wallace, director

Column type Capillary
Active phase SPB-5
Column length (m) 60.
Carrier gas He
Substrate
Column diameter (mm) 0.32
Phase thickness (μm) 1.
Tstart (C) 40.
Tend (C) 230.
Heat rate (K/min) 3.
Initial hold (min) 5.
Final hold (min) 5.
I 1009.
ReferenceDeport, Ratel, et al., 2006
Comment MSDC-RI

Van Den Dool and Kratz RI, polar column, custom temperature program

Data compiled by: NIST Mass Spectrometry Data Center, William E. Wallace, director

Column type Capillary
Active phase Stabilwax
Column length (m) 30.
Carrier gas He
Substrate
Column diameter (mm) 0.25
Phase thickness (μm) 0.25
Program 40C => 3C/min => 100C => 5C/min => 240C(10min)
I 2044.
ReferenceNatali N., Chinnici F., et al., 2006
Comment MSDC-RI

References

Stern and Klebs, 1933
Stern, A.; Klebs, G.,
Calorimetrische bestimmungen bei mehrkernigen pyrrolderivaten. IV. 1. Experimentelle daten fur einige porphyrine, chlorine, phaophorbide and purpurine,
Ann. Chim., 1933, 505, 295-306. [all data]
Cox and Pilcher, 1970
Cox, J.D.; Pilcher, G.,
Thermochemistry of Organic and Organometallic Compounds, Academic Press, New York, 1970, 1-636. [all data]
Weast and Grasselli, 1989
CRC Handbook of Data on Organic Compounds, 2nd Editon, Weast,R.C and Grasselli, J.G., ed(s)., CRC Press, Inc., Boca Raton, FL, 1989, 1. [all data]
Linda, Marino, et al., 1971
Linda, P.; Marino, G.; Pignataro, S.,
A comparison of sensitivities to substituent effects of five- membered heteroaromatic rings in gas phase ionization,
J. Chem. Soc. B, 1971, 1585. [all data]