Cyclopropane, 1,1-diethyl-
- Formula: C7H14
- Molecular weight: 98.1861
- IUPAC Standard InChIKey: VUROAZUCSQPSOK-UHFFFAOYSA-N
- CAS Registry Number: 1003-19-6
- Chemical structure:
View 3d structure (requires JavaScript / HTML 5) - Other names: 1,1-Diethylcyclopropane

Phase change data

Data compiled by: Thermodynamics Research Center, NIST Boulder Laboratories, Chris Muzny director
Quantity | Value | Units | Method | Reference | Comment |
---|---|---|---|---|---|
Tboil | 361.82 | K | N/A | Shortridge, Craig, et al., 1948 | Uncertainty assigned by TRC = 0.5 K |
Tboil | 361.79 | K | N/A | Boord, Greenlee, et al., 1945 | Uncertainty assigned by TRC = 0.3 K |
Tboil | 361.79 | K | N/A | Greenlee and Waalkes, 1945 | Uncertainty assigned by TRC = 0.3 K |
Tboil | 361.81 | K | N/A | Boord, Perilstein, et al., 1944 | Uncertainty assigned by TRC = 0.2 K |
Tboil | 361.82 | K | N/A | Boord, 1944 | Uncertainty assigned by TRC = 0.25 K |
Quantity | Value | Units | Method | Reference | Comment |
Tfus | 167.24 | K | N/A | Shortridge, Craig, et al., 1948 | Uncertainty assigned by TRC = 0.2 K |
Tfus | 167.05 | K | N/A | Boord, Greenlee, et al., 1945 | Uncertainty assigned by TRC = 0.2 K |
Tfus | 167.05 | K | N/A | Greenlee and Waalkes, 1945 | Uncertainty assigned by TRC = 0.25 K |
Tfus | 167.09 | K | N/A | Boord, Perilstein, et al., 1944 | Uncertainty assigned by TRC = 0.3 K |
Tfus | 167.24 | K | N/A | Boord, 1944 | Uncertainty assigned by TRC = 0.2 K |

Gas phase ion energetics data

Data compiled by: Sharon G. Lias and Joel F. Liebman
Ionization energy determinations
IE (eV) | Method | Reference |
---|---|---|
8.56 ± 0.05 | EI | Holmes and Lossing, 1991 |

Kovats' RI, non-polar column, isothermal

Column type | Active phase | Temperature (C) | I | Reference | Comment |
---|---|---|---|---|---|
Packed | Squalane | 60. | 673. | Bogoslovsky, Anvaer, et al., 1978 | |
Capillary | Squalane | 60. | 672.8 | Schomburg and Dielmann, 1973 | Column length: 100. m; Column diameter: 0.25 mm |

Normal alkane RI, non-polar column, custom temperature program

Column type | Active phase | I | Reference | Comment |
---|---|---|---|---|
Capillary | Squalane | 673. | Chen, 2008 | Program: not specified |

References

Shortridge, Craig, et al., 1948
Shortridge, R.W.; Craig, R.A.; Greenlee, K.W.; Derfer, J.M.; Boord, C.E.,
The Synthesis of Some Cyclopropane and Spirane Hydrocarbons,
J. Am. Chem. Soc., 1948, 70, 946. [all data]
Boord, Greenlee, et al., 1945
Boord, C.E.; Greenlee, K.W.; Perilstein, W.L.,
, Am. Pet. Inst. Res. Proj. 45, Seventh Annu. Rep., Ohio State Univ., June 30, 1945. [all data]
Greenlee and Waalkes, 1945
Greenlee, K.W.; Waalkes, T.P.,
, Am. Pet. Inst. Res. Proj. 45 No. 123A, Ohio State Univ., 1945. [all data]
Boord, Perilstein, et al., 1944
Boord, C.E.; Perilstein, W.L.; Greenlee, K.W.,
, Am. Pet. Inst. Hydrocarbon Res. Proj., Sixth Annu. Ref., Ohio State Univ., Aug. 31, 1944. [all data]
Boord, 1944
Boord, C.E.,
, Am. Pet. Inst. Hydrocarbon Res. Proj. No. 123-S, Ohio State Univ., 1944. [all data]
Holmes and Lossing, 1991
Holmes, J.L.; Lossing, F.P.,
Ionization energies of homologous organic compounds and correlation with molecular size,
Org. Mass Spectrom., 1991, 26, 537. [all data]
Bogoslovsky, Anvaer, et al., 1978
Bogoslovsky, Yu.N.; Anvaer, B.I.; Vigdergauz, M.S.,
Chromatographic constants in gas chromatography (in Russian), Standards Publ. House, Moscow, 1978, 192. [all data]
Schomburg and Dielmann, 1973
Schomburg, G.; Dielmann, G.,
Use of retention increments for identification and correlation of saturated and unsaturated cyclopropane hydrocarbons by means of Kovats indices,
Anal. Chem., 1973, 45, 9, 1647-1658, https://doi.org/10.1021/ac60331a021
. [all data]
Chen, 2008
Chen, H.-F.,
Quantitative prediction of gas chromatography retention indices with support vector machines, radial basis neutral networks and multiple linear regression,
Anal. Chim. Acta, 2008, 609, 1, 24-36, https://doi.org/10.1016/j.aca.2008.01.003
. [all data]