lead dibromide
- Formula: Br2Pb
- Molecular weight: 367.0
- CAS Registry Number: 10031-22-8

Condensed phase thermochemistry data

Quantity | Value | Units | Method | Reference | Comment |
---|---|---|---|---|---|
ΔfH°liquid | -267.41 | kJ/mol | Review | Chase, 1998 | Data last reviewed in December, 1973 |
Quantity | Value | Units | Method | Reference | Comment |
S°liquid,1 bar | 173.88 | J/mol*K | Review | Chase, 1998 | Data last reviewed in December, 1973 |
Quantity | Value | Units | Method | Reference | Comment |
ΔfH°solid | -277.40 | kJ/mol | Review | Chase, 1998 | Data last reviewed in December, 1973 |
Quantity | Value | Units | Method | Reference | Comment |
S°solid | 161.19 | J/mol*K | Review | Chase, 1998 | Data last reviewed in December, 1973 |
Liquid Phase Heat Capacity (Shomate Equation)
Cp° = A + B*t + C*t2 + D*t3 +
E/t2
H° − H°298.15= A*t + B*t2/2 +
C*t3/3 + D*t4/4 − E/t + F − H
S° = A*ln(t) + B*t + C*t2/2 + D*t3/3 −
E/(2*t2) + G
Cp = heat capacity (J/mol*K)
H° = standard enthalpy (kJ/mol)
S° = standard entropy (J/mol*K)
t = temperature (K) / 1000.
View plot Requires a JavaScript / HTML 5 canvas capable browser.
Temperature (K) | 644. to 2000. |
---|---|
A | 112.1312 |
B | 0.000000 |
C | 0.000000 |
D | 0.000000 |
E | 0.000000 |
F | -304.0709 |
G | 300.2518 |
H | -267.4124 |
Reference | Chase, 1998 |
Comment | Data last reviewed in December, 1973 |
Solid Phase Heat Capacity (Shomate Equation)
Cp° = A + B*t + C*t2 + D*t3 +
E/t2
H° − H°298.15= A*t + B*t2/2 +
C*t3/3 + D*t4/4 − E/t + F − H
S° = A*ln(t) + B*t + C*t2/2 + D*t3/3 −
E/(2*t2) + G
Cp = heat capacity (J/mol*K)
H° = standard enthalpy (kJ/mol)
S° = standard entropy (J/mol*K)
t = temperature (K) / 1000.
View plot Requires a JavaScript / HTML 5 canvas capable browser.
Temperature (K) | 298. to 644. |
---|---|
A | 52.27029 |
B | 66.71053 |
C | -19.01536 |
D | 5.130002 |
E | 0.799487 |
F | -293.0888 |
G | 209.8502 |
H | -277.3992 |
Reference | Chase, 1998 |
Comment | Data last reviewed in December, 1973 |

Gas phase ion energetics data

Data compiled as indicated in comments:
LBLHLM - Sharon G. Lias, John E. Bartmess, Joel F. Liebman, John L. Holmes, Rhoda D. Levin, and W. Gary Mallard
LLK - Sharon G. Lias, Rhoda D. Levin, and Sherif A. Kafafi
RDSH - Henry M. Rosenstock, Keith Draxl, Bruce W. Steiner, and John T. Herron
Ionization energy determinations
IE (eV) | Method | Reference | Comment |
---|---|---|---|
9.6 | PE | Novak and Potts, 1984 | LBLHLM |
10.2 ± 0.2 | EI | Hastie, Bloom, et al., 1967 | RDSH |
9.85 | PE | Novak and Potts, 1984 | Vertical value; LBLHLM |
9.81 ± 0.05 | PE | Evans and Orchard, 1975 | Vertical value; LLK |
Appearance energy determinations
Ion | AE (eV) | Other Products | Method | Reference | Comment |
---|---|---|---|---|---|
PbBr+ | 10.5 ± 0.2 | Br | EI | Hastie, Bloom, et al., 1967 | RDSH |

Gas phase thermochemistry data

Quantity Value Units Method Reference Comment
Δfgas-104.39kJ/molReviewChase, 1998Data last reviewed in December, 1973
Quantity Value Units Method Reference Comment
gas,1 bar339.39J/mol*KReviewChase, 1998Data last reviewed in December, 1973

Gas Phase Heat Capacity (Shomate Equation)

Cp° = A + B*t + C*t2 + D*t3 + E/t2
H° − H°298.15= A*t + B*t2/2 + C*t3/3 + D*t4/4 − E/t + F − H
S° = A*ln(t) + B*t + C*t2/2 + D*t3/3 − E/(2*t2) + G
    Cp = heat capacity (J/mol*K)
    H° = standard enthalpy (kJ/mol)
    S° = standard entropy (J/mol*K)
    t = temperature (K) / 1000.

View plot Requires a JavaScript / HTML 5 canvas capable browser.

View table.

Temperature (K) 2000. - 6000.
A 58.17768
B 0.020038
C -0.005447
D 0.000465
E -0.112831
F -122.1163
G 409.1496
H -104.3912
ReferenceChase, 1998
Comment Data last reviewed in December, 1973

References

Chase, 1998
Chase, M.W., Jr.,
NIST-JANAF Themochemical Tables, Fourth Edition,
J. Phys. Chem. Ref. Data, Monograph 9, 1998, 1-1951. [all data]
Novak and Potts, 1984
Novak, I.; Potts, A.W.,
Ultraviolet photoelectron spectra of gas phase and condensed tin and lead dihalides (MX2, M = Sn, Pb X = Cl, Br, I),
J. Electron Spectrosc. Relat. Phenom., 1984, 33, 1. [all data]
Hastie, Bloom, et al., 1967
Hastie, J.W.; Bloom, H.; Morrison, J.D.,
Electronimpact studies of PbCl2, PbBr2, and PbClBr,
J. Chem. Phys., 1967, 47, 1580. [all data]
Evans and Orchard, 1975
Evans, S.; Orchard, A.F.,
The vapour phase ultra-violet photoelectron spectroscopy of metal halides at elevated temperatures,
J. Electron Spectrosc. Relat. Phenom., 1975, 6, 207. [all data]